{"text_format":"1","workbook":"xlsx","n_sheets":5,"sheets":["Kosten","Zeiten","Projektsummen","Projektdetails","Anwendungshilfe"],"not_rendered":{"charts":0,"images":2,"macros":1,"external_links":1,"defined_names":9,"comments":2,"pivot_tables":0},"unopened":[],"bounds":{"document_bytes":16777216,"sheet_cells":100000,"rows_first":2000,"rows_last":500,"rows_between":2000,"halvings":0,"cell_chars":16384,"cell_head_chars":4096},"cells_cut":0,"cells_raw":0,"read":"whole","date_system":"1900"}

{"sheet":"Kosten","index":0,"n_rows":65,"n_cols":16,"rows_kept":65,"cut":false,"hidden":false,"merged":[[2,3,2,4]]}
[]
[null,"Projektabrechnung - laufende Kosten"]
[]
[]
[]
[null,"S","aufgelaufene Kosten",null,null,null,null,{"$f":"SUM(H10:H1001)","v":27190},null,{"$f":"SUM(J10:J1001)","v":22848.73949579832}]
[]
[null,"Datum","Rechnungs-\nNr.","Projekt-\nNr.","Projekt-Bezeichnung","Leistung /\nMaterial o.ä.","Lieferant / \nGläubiger","Brutto \nEUR","MwSt","Netto \nEUR","frei 1","frei 2","frei 3","frei 4"]
[null,"Datum","Mitarbeiter","Projekt-\nNr.","Projekt-Bezeichnung","Leistung /\nMaterial o.ä.","Lieferant / \nGläubiger","Brutto \nEUR","19 %\nMwSt","Netto \nEUR","Skonto-Tage","Skonto-%","Netto-Tage","frei"]
[null,45495,2596354,4711,{"$f":"IF(Kosten[[#This Row],[Projekt-\nNr.]]=\"\",\"\",VLOOKUP(Kosten[[#This Row],[Projekt-\nNr.]],Projektsummen[[Projekt-\nNr.]:[Projekt-Bezeichnung]],2,0))","v":"Umgestaltung"},"Leistung ABC","Fa. Soundso",1190,0.19,{"$f":"H10/(1+I10)*1","v":1000}]
[null,45558,123456,4713,{"$f":"IF(Kosten[[#This Row],[Projekt-\nNr.]]=\"\",\"\",VLOOKUP(Kosten[[#This Row],[Projekt-\nNr.]],Projektsummen[[Projekt-\nNr.]:[Projekt-Bezeichnung]],2,0))","v":"Restrukturierung"},"Leistung XYZ","Fa. Gegenüber",2000,0.19,{"$f":"H11/(1+I11)*1","v":1680.6722689075632}]
[null,45566,"3689245-A",4714,{"$f":"IF(Kosten[[#This Row],[Projekt-\nNr.]]=\"\",\"\",VLOOKUP(Kosten[[#This Row],[Projekt-\nNr.]],Projektsummen[[Projekt-\nNr.]:[Projekt-Bezeichnung]],2,0))","v":"Rekultivierung"},"Neues Material","XYZ GmbH",4500,0.19,3781.5126050420172]
[null,45567,"3689245-D",4714,{"$f":"IF(Kosten[[#This Row],[Projekt-\nNr.]]=\"\",\"\",VLOOKUP(Kosten[[#This Row],[Projekt-\nNr.]],Projektsummen[[Projekt-\nNr.]:[Projekt-Bezeichnung]],2,0))","v":"Rekultivierung"},"Weiteres Material","Zett AG",2500,0.19,2100.840336134454]
[null,45568,9563214,4712,{"$f":"IF(Kosten[[#This Row],[Projekt-\nNr.]]=\"\",\"\",VLOOKUP(Kosten[[#This Row],[Projekt-\nNr.]],Projektsummen[[Projekt-\nNr.]:[Projekt-Bezeichnung]],2,0))","v":"Neugestaltung"},"Weiteres Material","Zett AG",1500,0.19,1260.5042016806724]
[null,45569,9563215,4712,{"$f":"IF(Kosten[[#This Row],[Projekt-\nNr.]]=\"\",\"\",VLOOKUP(Kosten[[#This Row],[Projekt-\nNr.]],Projektsummen[[Projekt-\nNr.]:[Projekt-Bezeichnung]],2,0))","v":"Neugestaltung"},"Anderes Material","Zett AG",1000,0.19,840.3361344537816]
[null,45570,9563216,4712,{"$f":"IF(Kosten[[#This Row],[Projekt-\nNr.]]=\"\",\"\",VLOOKUP(Kosten[[#This Row],[Projekt-\nNr.]],Projektsummen[[Projekt-\nNr.]:[Projekt-Bezeichnung]],2,0))","v":"Neugestaltung"},"Weiteres Material","Zett AG",2300,0.19,1932.7731092436975]
[null,45572,9563217,4712,{"$f":"IF(Kosten[[#This Row],[Projekt-\nNr.]]=\"\",\"\",VLOOKUP(Kosten[[#This Row],[Projekt-\nNr.]],Projektsummen[[Projekt-\nNr.]:[Projekt-Bezeichnung]],2,0))","v":"Neugestaltung"},"Gutes Material","Zett AG",2500,0.19,2100.840336134454]
[null,45573,9563218,4712,{"$f":"IF(Kosten[[#This Row],[Projekt-\nNr.]]=\"\",\"\",VLOOKUP(Kosten[[#This Row],[Projekt-\nNr.]],Projektsummen[[Projekt-\nNr.]:[Projekt-Bezeichnung]],2,0))","v":"Neugestaltung"},"Weiteres Material","Zett AG",600,0.19,504.20168067226894]
[null,45574,9563219,4712,{"$f":"IF(Kosten[[#This Row],[Projekt-\nNr.]]=\"\",\"\",VLOOKUP(Kosten[[#This Row],[Projekt-\nNr.]],Projektsummen[[Projekt-\nNr.]:[Projekt-Bezeichnung]],2,0))","v":"Neugestaltung"},"Weiteres Material","Zett AG",4900,0.19,4117.6470588235297]
[null,45575,56824566,5689,{"$f":"IF(Kosten[[#This Row],[Projekt-\nNr.]]=\"\",\"\",VLOOKUP(Kosten[[#This Row],[Projekt-\nNr.]],Projektsummen[[Projekt-\nNr.]:[Projekt-Bezeichnung]],2,0))","v":"Neustart"},"Service Leistung","Service Truppe",2000,0.19,{"$f":"H20/(1+I20)*1","v":1680.6722689075632}]
[null,45576,56824566,5689,{"$f":"IF(Kosten[[#This Row],[Projekt-\nNr.]]=\"\",\"\",VLOOKUP(Kosten[[#This Row],[Projekt-\nNr.]],Projektsummen[[Projekt-\nNr.]:[Projekt-Bezeichnung]],2,0))","v":"Neustart"},"Service Leistung","Service Truppe",2200,0.19,{"$f":"H21/(1+I21)*1","v":1848.7394957983195}]
[]
[]
[]
[]
[]
[]
[]
[]
[]
[]
[]
[]
[]
[]
[]
[]
[]
[]
[]
[]
[]
[]
[]
[]
[]
[]
[]
[]
[]
[]
[]
[]
[]
[]
[]
[]
[]
[]
[]
[]
[]
[]
[null,null,null,null,null,null,null,null,null,null,null,null,null,null,null,"Weitere Projekt-Tools finden Sie auf"]
[null,null,null,null,null,null,null,null,null,null,null,null,null,null,null,"https://www.ControllerSpielwiese.de"]

{"sheet":"Zeiten","index":1,"n_rows":64,"n_cols":15,"rows_kept":64,"cut":false,"hidden":false,"merged":[[2,3,2,4]]}
[]
[null,"Projektabrechnung - Arbeitszeiterfassung"]
[]
[]
[]
[null,"S","aufgelaufene Zeiten",null,null,null,{"$f":"SUM(G9:G1000)","v":85},null,{"$f":"SUM(I9:I1000)","v":1724},{"$f":"SUM(J9:J1000)","v":48},{"$f":"SUM(K9:K1000)","v":1772}]
[]
[null,"Datum","Mitarbeiter","Projekt-\nNr.","Projekt-Bezeichnung","Leistung /\nMaterial o.ä.","Anzahl \nStd.","Stundensatz\nEUR","Arbeitszeit \nEUR","Spesen \nEUR","S Personalkosten \nEUR","frei1","frei2"]
[null,45495,"Mitarbeiter 1",4711,{"$f":"IF(Zeiten[[#This Row],[Projekt-\nNr.]]=\"\",\"\",VLOOKUP(Zeiten[[#This Row],[Projekt-\nNr.]],Projektsummen[[Projekt-\nNr.]:[Projekt-Bezeichnung]],2,0))","v":"Umgestaltung"},"umgestalten",5,24,{"$f":"Zeiten[[#This Row],[Anzahl \nStd.]]*Zeiten[[#This Row],[Stundensatz\nEUR]]","v":120},null,{"$f":"Zeiten[[#This Row],[Spesen \nEUR]]+Zeiten[[#This Row],[Arbeitszeit \nEUR]]","v":120}]
[null,45558,"Mitarbeiter 3",4713,{"$f":"IF(Zeiten[[#This Row],[Projekt-\nNr.]]=\"\",\"\",VLOOKUP(Zeiten[[#This Row],[Projekt-\nNr.]],Projektsummen[[Projekt-\nNr.]:[Projekt-Bezeichnung]],2,0))","v":"Restrukturierung"},"restrukturieren",12,16,{"$f":"Zeiten[[#This Row],[Anzahl \nStd.]]*Zeiten[[#This Row],[Stundensatz\nEUR]]","v":192},24,{"$f":"Zeiten[[#This Row],[Spesen \nEUR]]+Zeiten[[#This Row],[Arbeitszeit \nEUR]]","v":216}]
[null,45566,"Mitarbeiter 5",4714,{"$f":"IF(Zeiten[[#This Row],[Projekt-\nNr.]]=\"\",\"\",VLOOKUP(Zeiten[[#This Row],[Projekt-\nNr.]],Projektsummen[[Projekt-\nNr.]:[Projekt-Bezeichnung]],2,0))","v":"Rekultivierung"},"rekultivieren",8,23,{"$f":"Zeiten[[#This Row],[Anzahl \nStd.]]*Zeiten[[#This Row],[Stundensatz\nEUR]]","v":184},null,{"$f":"Zeiten[[#This Row],[Spesen \nEUR]]+Zeiten[[#This Row],[Arbeitszeit \nEUR]]","v":184}]
[null,45567,"Mitarbeiter 1",4712,{"$f":"IF(Zeiten[[#This Row],[Projekt-\nNr.]]=\"\",\"\",VLOOKUP(Zeiten[[#This Row],[Projekt-\nNr.]],Projektsummen[[Projekt-\nNr.]:[Projekt-Bezeichnung]],2,0))","v":"Neugestaltung"},"rekultivieren",8,24,{"$f":"Zeiten[[#This Row],[Anzahl \nStd.]]*Zeiten[[#This Row],[Stundensatz\nEUR]]","v":192},null,{"$f":"Zeiten[[#This Row],[Spesen \nEUR]]+Zeiten[[#This Row],[Arbeitszeit \nEUR]]","v":192}]
[null,45568,"Mitarbeiter 2",4712,{"$f":"IF(Zeiten[[#This Row],[Projekt-\nNr.]]=\"\",\"\",VLOOKUP(Zeiten[[#This Row],[Projekt-\nNr.]],Projektsummen[[Projekt-\nNr.]:[Projekt-Bezeichnung]],2,0))","v":"Neugestaltung"},"rekultivieren",8,18.5,{"$f":"Zeiten[[#This Row],[Anzahl \nStd.]]*Zeiten[[#This Row],[Stundensatz\nEUR]]","v":148},null,{"$f":"Zeiten[[#This Row],[Spesen \nEUR]]+Zeiten[[#This Row],[Arbeitszeit \nEUR]]","v":148}]
[null,45569,"Mitarbeiter 1",4712,{"$f":"IF(Zeiten[[#This Row],[Projekt-\nNr.]]=\"\",\"\",VLOOKUP(Zeiten[[#This Row],[Projekt-\nNr.]],Projektsummen[[Projekt-\nNr.]:[Projekt-Bezeichnung]],2,0))","v":"Neugestaltung"},"rekultivieren",10,24,{"$f":"Zeiten[[#This Row],[Anzahl \nStd.]]*Zeiten[[#This Row],[Stundensatz\nEUR]]","v":240},null,{"$f":"Zeiten[[#This Row],[Spesen \nEUR]]+Zeiten[[#This Row],[Arbeitszeit \nEUR]]","v":240}]
[null,45570,"Mitarbeiter 2",4712,{"$f":"IF(Zeiten[[#This Row],[Projekt-\nNr.]]=\"\",\"\",VLOOKUP(Zeiten[[#This Row],[Projekt-\nNr.]],Projektsummen[[Projekt-\nNr.]:[Projekt-Bezeichnung]],2,0))","v":"Neugestaltung"},"rekultivieren",8,18.5,{"$f":"Zeiten[[#This Row],[Anzahl \nStd.]]*Zeiten[[#This Row],[Stundensatz\nEUR]]","v":148},null,{"$f":"Zeiten[[#This Row],[Spesen \nEUR]]+Zeiten[[#This Row],[Arbeitszeit \nEUR]]","v":148}]
[null,45572,"Mitarbeiter 1",4712,{"$f":"IF(Zeiten[[#This Row],[Projekt-\nNr.]]=\"\",\"\",VLOOKUP(Zeiten[[#This Row],[Projekt-\nNr.]],Projektsummen[[Projekt-\nNr.]:[Projekt-Bezeichnung]],2,0))","v":"Neugestaltung"},"rekultivieren",8,24,{"$f":"Zeiten[[#This Row],[Anzahl \nStd.]]*Zeiten[[#This Row],[Stundensatz\nEUR]]","v":192},12,{"$f":"Zeiten[[#This Row],[Spesen \nEUR]]+Zeiten[[#This Row],[Arbeitszeit \nEUR]]","v":204}]
[null,45573,"Mitarbeiter 2",4712,{"$f":"IF(Zeiten[[#This Row],[Projekt-\nNr.]]=\"\",\"\",VLOOKUP(Zeiten[[#This Row],[Projekt-\nNr.]],Projektsummen[[Projekt-\nNr.]:[Projekt-Bezeichnung]],2,0))","v":"Neugestaltung"},"rekultivieren",8,18.5,{"$f":"Zeiten[[#This Row],[Anzahl \nStd.]]*Zeiten[[#This Row],[Stundensatz\nEUR]]","v":148},12,{"$f":"Zeiten[[#This Row],[Spesen \nEUR]]+Zeiten[[#This Row],[Arbeitszeit \nEUR]]","v":160}]
[null,45574,"Mitarbeiter 3",4712,{"$f":"IF(Zeiten[[#This Row],[Projekt-\nNr.]]=\"\",\"\",VLOOKUP(Zeiten[[#This Row],[Projekt-\nNr.]],Projektsummen[[Projekt-\nNr.]:[Projekt-Bezeichnung]],2,0))","v":"Neugestaltung"},"rekultivieren",10,16,{"$f":"Zeiten[[#This Row],[Anzahl \nStd.]]*Zeiten[[#This Row],[Stundensatz\nEUR]]","v":160},null,{"$f":"Zeiten[[#This Row],[Spesen \nEUR]]+Zeiten[[#This Row],[Arbeitszeit \nEUR]]","v":160}]
[]
[]
[]
[]
[]
[]
[]
[]
[]
[]
[]
[]
[]
[]
[]
[]
[]
[]
[]
[]
[]
[]
[]
[]
[]
[]
[]
[]
[]
[]
[]
[]
[]
[]
[]
[]
[]
[]
[]
[]
[]
[]
[]
[]
[null,null,null,null,null,null,null,null,null,null,null,null,null,null,"Weitere Projekt-Tools finden Sie auf"]
[null,null,null,null,null,null,null,null,null,null,null,null,null,null,"https://www.ControllerSpielwiese.de"]

{"sheet":"Projektsummen","index":2,"n_rows":60,"n_cols":14,"rows_kept":60,"cut":false,"hidden":false,"merged":[[2,3,2,4]]}
[]
[null,"Projektabrechnung - Übersicht / Summen aller Projekte"]
[]
[]
[]
[null,"S","aufgelaufene Zeiten",{"$f":"SUM(Projektsummen[Kosten EUR])","v":22848.73949579832},{"$f":"SUM(Projektsummen[Zeiten h])","v":85},{"$f":"SUM(Projektsummen[Zeiten EUR])","v":1724},{"$f":"SUM(Projektsummen[Spesen EUR])","v":48},{"$f":"SUM(Projektsummen[Personal EUR])","v":1772},{"$f":"SUM(Projektsummen[Summe EUR])","v":24620.73949579832}]
[]
[null,"Projekt-\nNr.","Projekt-Bezeichnung","Kosten EUR","Zeiten h","Zeiten EUR","Spesen EUR","Personal EUR","Summe EUR","frei 1","frei 2","frei 3"]
[null,4711,"Umgestaltung",{"$f":"SUMIF(Kosten[[Projekt-\nNr.]:[Netto \nEUR]],B9,Kosten[Netto \nEUR])","v":1000},{"$f":"SUMIF(Zeiten[[Projekt-\nNr.]:[Arbeitszeit \nEUR]],B9,Zeiten[Anzahl \nStd.])","v":5},{"$f":"SUMIF(Zeiten[[Projekt-\nNr.]:[Arbeitszeit \nEUR]],B9,Zeiten[Arbeitszeit \nEUR])","v":120},{"$f":"SUMIF(Zeiten[[Projekt-\nNr.]:[Spesen \nEUR]],B9,Zeiten[Spesen \nEUR])","v":0},{"$f":"F9+G9","v":120},{"$f":"D9+H9","v":1120}]
[null,4712,"Neugestaltung",{"$f":"SUMIF(Kosten[[Projekt-\nNr.]:[Netto \nEUR]],B10,Kosten[Netto \nEUR])","v":10756.302521008405},{"$f":"SUMIF(Zeiten[[Projekt-\nNr.]:[Arbeitszeit \nEUR]],B10,Zeiten[Anzahl \nStd.])","v":60},{"$f":"SUMIF(Zeiten[[Projekt-\nNr.]:[Arbeitszeit \nEUR]],B10,Zeiten[Arbeitszeit \nEUR])","v":1228},{"$f":"SUMIF(Zeiten[[Projekt-\nNr.]:[Spesen \nEUR]],B10,Zeiten[Spesen \nEUR])","v":24},{"$f":"F10+G10","v":1252},{"$f":"D10+H10","v":12008.302521008405}]
[null,4713,"Restrukturierung",{"$f":"SUMIF(Kosten[[Projekt-\nNr.]:[Netto \nEUR]],B11,Kosten[Netto \nEUR])","v":1680.6722689075632},{"$f":"SUMIF(Zeiten[[Projekt-\nNr.]:[Arbeitszeit \nEUR]],B11,Zeiten[Anzahl \nStd.])","v":12},{"$f":"SUMIF(Zeiten[[Projekt-\nNr.]:[Arbeitszeit \nEUR]],B11,Zeiten[Arbeitszeit \nEUR])","v":192},{"$f":"SUMIF(Zeiten[[Projekt-\nNr.]:[Spesen \nEUR]],B11,Zeiten[Spesen \nEUR])","v":24},{"$f":"F11+G11","v":216},{"$f":"D11+H11","v":1896.6722689075632}]
[null,4714,"Rekultivierung",{"$f":"SUMIF(Kosten[[Projekt-\nNr.]:[Netto \nEUR]],B12,Kosten[Netto \nEUR])","v":5882.3529411764712},{"$f":"SUMIF(Zeiten[[Projekt-\nNr.]:[Arbeitszeit \nEUR]],B12,Zeiten[Anzahl \nStd.])","v":8},{"$f":"SUMIF(Zeiten[[Projekt-\nNr.]:[Arbeitszeit \nEUR]],B12,Zeiten[Arbeitszeit \nEUR])","v":184},{"$f":"SUMIF(Zeiten[[Projekt-\nNr.]:[Spesen \nEUR]],B12,Zeiten[Spesen \nEUR])","v":0},{"$f":"F12+G12","v":184},{"$f":"D12+H12","v":6066.3529411764712}]
[null,5689,"Neustart",{"$f":"SUMIF(Kosten[[Projekt-\nNr.]:[Netto \nEUR]],B13,Kosten[Netto \nEUR])","v":3529.4117647058829},{"$f":"SUMIF(Zeiten[[Projekt-\nNr.]:[Arbeitszeit \nEUR]],B13,Zeiten[Anzahl \nStd.])","v":0},{"$f":"SUMIF(Zeiten[[Projekt-\nNr.]:[Arbeitszeit \nEUR]],B13,Zeiten[Arbeitszeit \nEUR])","v":0},{"$f":"SUMIF(Zeiten[[Projekt-\nNr.]:[Spesen \nEUR]],B13,Zeiten[Spesen \nEUR])","v":0},{"$f":"F13+G13","v":0},{"$f":"D13+H13","v":3529.4117647058829}]
[]
[]
[]
[]
[]
[]
[]
[]
[]
[]
[]
[]
[]
[]
[]
[]
[]
[]
[]
[]
[]
[]
[]
[]
[]
[]
[]
[]
[]
[]
[]
[]
[]
[]
[]
[]
[]
[]
[]
[]
[]
[]
[]
[]
[]
[null,null,null,null,null,null,null,null,null,null,null,null,null,"Weitere Projekt-Tools finden Sie auf"]
[null,null,null,null,null,null,null,null,null,null,null,null,null,"https://www.ControllerSpielwiese.de"]

{"sheet":"Projektdetails","index":3,"n_rows":5006,"n_cols":18,"rows_kept":5006,"cut":false,"hidden":false,"merged":[[2,4,2,5]]}
[]
[null,"Projektabrechnung - Projektdetails"]
[]
[]
[]
[null,"S","aller / gefilterter Kosten und Stunden",null,null,null,null,null,null,{"$f":"SUBTOTAL(9,J9:J5006)","v":22848.73949579832},{"$f":"SUBTOTAL(9,K9:K5006)","v":85},null,{"$f":"SUBTOTAL(9,M9:M5006)","v":1724},{"$f":"SUBTOTAL(9,N9:N5006)","v":48},{"$f":"SUBTOTAL(9,O9:O5006)","v":1772},{"$f":"SUBTOTAL(9,P9:P5006)","v":24620.73949579832}]
[]
[null,"Datum","Mitarbeiter/ Re-Nr.","Projekt-\nNr.","Projekt-Bezeichnung","Leistung /\nMaterial o.ä.","Lieferant / \nGläubiger","Kosten brutto EUR","MwSt \n19 %","Kosten netto EUR","Anzahl \nStd.","Stundensatz\nEUR","Arbeitszeit \nEUR","Spesen \nEUR","S Personal- kosten EUR","S Projekt-\nkosten EUR"]
[null,45495,2596354,4711,"Umgestaltung","Leistung ABC","Fa. Soundso",1190,0.19,1000,null,null,null,null,null,{"$f":"J9+O9","v":1000}]
[null,45495,"Mitarbeiter 1",4711,"Umgestaltung","umgestalten",null,null,null,null,5,24,120,null,120,{"$f":"J10+O10","v":120}]
[null,45558,123456,4713,"Restrukturierung","Leistung XYZ","Fa. Gegenüber",2000,0.19,1680.6722689075632,null,null,null,null,null,{"$f":"J11+O11","v":1680.6722689075632}]
[null,45558,"Mitarbeiter 3",4713,"Restrukturierung","restrukturieren",null,null,null,null,12,16,192,24,216,{"$f":"J12+O12","v":216}]
[null,45566,"3689245-A",4714,"Rekultivierung","Neues Material","XYZ GmbH",4500,0.19,3781.5126050420172,null,null,null,null,null,{"$f":"J13+O13","v":3781.5126050420172}]
[null,45566,"Mitarbeiter 5",4714,"Rekultivierung","rekultivieren",null,null,null,null,8,23,184,null,184,{"$f":"J14+O14","v":184}]
[null,45567,"3689245-D",4714,"Rekultivierung","Weiteres Material","Zett AG",2500,0.19,2100.840336134454,null,null,null,null,null,{"$f":"J15+O15","v":2100.840336134454}]
[null,45567,"Mitarbeiter 1",4712,"Neugestaltung","rekultivieren",null,null,null,null,8,24,192,null,192,{"$f":"J16+O16","v":192}]
[null,45568,9563214,4712,"Neugestaltung","Weiteres Material","Zett AG",1500,0.19,1260.5042016806724,null,null,null,null,null,{"$f":"J17+O17","v":1260.5042016806724}]
[null,45568,"Mitarbeiter 2",4712,"Neugestaltung","rekultivieren",null,null,null,null,8,18.5,148,null,148,{"$f":"J18+O18","v":148}]
[null,45569,9563215,4712,"Neugestaltung","Anderes Material","Zett AG",1000,0.19,840.3361344537816,null,null,null,null,null,{"$f":"J19+O19","v":840.3361344537816}]
[null,45569,"Mitarbeiter 1",4712,"Neugestaltung","rekultivieren",null,null,null,null,10,24,240,null,240,{"$f":"J20+O20","v":240}]
[null,45570,9563216,4712,"Neugestaltung","Weiteres Material","Zett AG",2300,0.19,1932.7731092436975,null,null,null,null,null,{"$f":"J21+O21","v":1932.7731092436975}]
[null,45570,"Mitarbeiter 2",4712,"Neugestaltung","rekultivieren",null,null,null,null,8,18.5,148,null,148,{"$f":"J22+O22","v":148}]
[null,45572,9563217,4712,"Neugestaltung","Gutes Material","Zett AG",2500,0.19,2100.840336134454,null,null,null,null,null,{"$f":"J23+O23","v":2100.840336134454}]
[null,45572,"Mitarbeiter 1",4712,"Neugestaltung","rekultivieren",null,null,null,null,8,24,192,12,204,{"$f":"J24+O24","v":204}]
[null,45573,9563218,4712,"Neugestaltung","Weiteres Material","Zett AG",600,0.19,504.20168067226894,null,null,null,null,null,{"$f":"J25+O25","v":504.20168067226894}]
[null,45573,"Mitarbeiter 2",4712,"Neugestaltung","rekultivieren",null,null,null,null,8,18.5,148,12,160,{"$f":"J26+O26","v":160}]
[null,45574,9563219,4712,"Neugestaltung","Weiteres Material","Zett AG",4900,0.19,4117.6470588235297,null,null,null,null,null,{"$f":"J27+O27","v":4117.6470588235297}]
[null,45574,"Mitarbeiter 3",4712,"Neugestaltung","rekultivieren",null,null,null,null,10,16,160,null,160,{"$f":"J28+O28","v":160}]
[null,45575,56824566,5689,"Neustart","Service Leistung","Service Truppe",2000,0.19,1680.6722689075632,null,null,null,null,null,{"$f":"J29+O29","v":1680.6722689075632}]
[null,45576,56824566,5689,"Neustart","Service Leistung","Service Truppe",2200,0.19,1848.7394957983195,null,null,null,null,null,{"$f":"J30+O30","v":1848.7394957983195}]
[null,null,null,null,null,null,null,null,null,null,null,null,null,null,null,{"$f":"J31+O31","v":0}]
[null,null,null,null,null,null,null,null,null,null,null,null,null,null,null,{"$f":"J32+O32","v":0}]
[null,null,null,null,null,null,null,null,null,null,null,null,null,null,null,{"$f":"J33+O33","v":0}]
[null,null,null,null,null,null,null,null,null,null,null,null,null,null,null,{"$f":"J34+O34","v":0}]
[null,null,null,null,null,null,null,null,null,null,null,null,null,null,null,{"$f":"J35+O35","v":0}]
[null,null,null,null,null,null,null,null,null,null,null,null,null,null,null,{"$f":"J36+O36","v":0}]
[null,null,null,null,null,null,null,null,null,null,null,null,null,null,null,{"$f":"J37+O37","v":0}]
[null,null,null,null,null,null,null,null,null,null,null,null,null,null,null,{"$f":"J38+O38","v":0}]
[null,null,null,null,null,null,null,null,null,null,null,null,null,null,null,{"$f":"J39+O39","v":0}]
[null,null,null,null,null,null,null,null,null,null,null,null,null,null,null,{"$f":"J40+O40","v":0}]
[null,null,null,null,null,null,null,null,null,null,null,null,null,null,null,{"$f":"J41+O41","v":0}]
[null,null,null,null,null,null,null,null,null,null,null,null,null,null,null,{"$f":"J42+O42","v":0}]
[null,null,null,null,null,null,null,null,null,null,null,null,null,null,null,{"$f":"J43+O43","v":0}]
[null,null,null,null,null,null,null,null,null,null,null,null,null,null,null,{"$f":"J44+O44","v":0}]
[null,null,null,null,null,null,null,null,null,null,null,null,null,null,null,{"$f":"J45+O45","v":0}]
[null,null,null,null,null,null,null,null,null,null,null,null,null,null,null,{"$f":"J46+O46","v":0}]
[null,null,null,null,null,null,null,null,null,null,null,null,null,null,null,{"$f":"J47+O47","v":0}]
[]
[]
[]
[]
[]
[]
[null,null,null,null,null,null,null,null,null,null,null,null,null,null,null,{"$f":"J54+O54","v":0}]
[null,null,null,null,null,null,null,null,null,null,null,null,null,null,null,{"$f":"J55+O55","v":0}]
[null,null,null,null,null,null,null,null,null,null,null,null,null,null,null,{"$f":"J56+O56","v":0}]
[null,null,null,null,null,null,null,null,null,null,null,null,null,null,null,{"$f":"J57+O57","v":0}]
[null,null,null,null,null,null,null,null,null,null,null,null,null,null,null,{"$f":"J58+O58","v":0}]
[null,null,null,null,null,null,null,null,null,null,null,null,null,null,null,{"$f":"J59+O59","v":0}]
[null,null,null,null,null,null,null,null,null,null,null,null,null,null,null,{"$f":"J60+O60","v":0},null,"Weitere Projekt-Tools finden Sie auf"]
[null,null,null,null,null,null,null,null,null,null,null,null,null,null,null,{"$f":"J61+O61","v":0},null,"https://www.ControllerSpielwiese.de"]
[null,null,null,null,null,null,null,null,null,null,null,null,null,null,null,{"$f":"J62+O62","v":0}]
[null,null,null,null,null,null,null,null,null,null,null,null,null,null,null,{"$f":"J63+O63","v":0}]
[null,null,null,null,null,null,null,null,null,null,null,null,null,null,null,{"$f":"J64+O64","v":0}]
[null,null,null,null,null,null,null,null,null,null,null,null,null,null,null,{"$f":"J65+O65","v":0}]
[null,null,null,null,null,null,null,null,null,null,null,null,null,null,null,{"$f":"J66+O66","v":0}]
[null,null,null,null,null,null,null,null,null,null,null,null,null,null,null,{"$f":"J67+O67","v":0}]
[null,null,null,null,null,null,null,null,null,null,null,null,null,null,null,{"$f":"J68+O68","v":0}]
[null,null,null,null,null,null,null,null,null,null,null,null,null,null,null,{"$f":"J69+O69","v":0}]
[null,null,null,null,null,null,null,null,null,null,null,null,null,null,null,{"$f":"J70+O70","v":0}]
[null,null,null,null,null,null,null,null,null,null,null,null,null,null,null,{"$f":"J71+O71","v":0}]
[null,null,null,null,null,null,null,null,null,null,null,null,null,null,null,{"$f":"J72+O72","v":0}]
[null,null,null,null,null,null,null,null,null,null,null,null,null,null,null,{"$f":"J73+O73","v":0}]
[null,null,null,null,null,null,null,null,null,null,null,null,null,null,null,{"$f":"J74+O74","v":0}]
[null,null,null,null,null,null,null,null,null,null,null,null,null,null,null,{"$f":"J75+O75","v":0}]
[null,null,null,null,null,null,null,null,null,null,null,null,null,null,null,{"$f":"J76+O76","v":0}]
[null,null,null,null,null,null,null,null,null,null,null,null,null,null,null,{"$f":"J77+O77","v":0}]
[null,null,null,null,null,null,null,null,null,null,null,null,null,null,null,{"$f":"J78+O78","v":0}]
[null,null,null,null,null,null,null,null,null,null,null,null,null,null,null,{"$f":"J79+O79","v":0}]
[null,null,null,null,null,null,null,null,null,null,null,null,null,null,null,{"$f":"J80+O80","v":0}]
[null,null,null,null,null,null,null,null,null,null,null,null,null,null,null,{"$f":"J81+O81","v":0}]
[null,null,null,null,null,null,null,null,null,null,null,null,null,null,null,{"$f":"J82+O82","v":0}]
[null,null,null,null,null,null,null,null,null,null,null,null,null,null,null,{"$f":"J83+O83","v":0}]
[null,null,null,null,null,null,null,null,null,null,null,null,null,null,null,{"$f":"J84+O84","v":0}]
[null,null,null,null,null,null,null,null,null,null,null,null,null,null,null,{"$f":"J85+O85","v":0}]
[null,null,null,null,null,null,null,null,null,null,null,null,null,null,null,{"$f":"J86+O86","v":0}]
[null,null,null,null,null,null,null,null,null,null,null,null,null,null,null,{"$f":"J87+O87","v":0}]
[null,null,null,null,null,null,null,null,null,null,null,null,null,null,null,{"$f":"J88+O88","v":0}]
[null,null,null,null,null,null,null,null,null,null,null,null,null,null,null,{"$f":"J89+O89","v":0}]
[null,null,null,null,null,null,null,null,null,null,null,null,null,null,null,{"$f":"J90+O90","v":0}]
[null,null,null,null,null,null,null,null,null,null,null,null,null,null,null,{"$f":"J91+O91","v":0}]
[null,null,null,null,null,null,null,null,null,null,null,null,null,null,null,{"$f":"J92+O92","v":0}]
[null,null,null,null,null,null,null,null,null,null,null,null,null,null,null,{"$f":"J93+O93","v":0}]
[null,null,null,null,null,null,null,null,null,null,null,null,null,null,null,{"$f":"J94+O94","v":0}]
[null,null,null,null,null,null,null,null,null,null,null,null,null,null,null,{"$f":"J95+O95","v":0}]
[null,null,null,null,null,null,null,null,null,null,null,null,null,null,null,{"$f":"J96+O96","v":0}]
[null,null,null,null,null,null,null,null,null,null,null,null,null,null,null,{"$f":"J97+O97","v":0}]
[null,null,null,null,null,null,null,null,null,null,null,null,null,null,null,{"$f":"J98+O98","v":0}]
[null,null,null,null,null,null,null,null,null,null,null,null,null,null,null,{"$f":"J99+O99","v":0}]
[null,null,null,null,null,null,null,null,null,null,null,null,null,null,null,{"$f":"J100+O100","v":0}]
[null,null,null,null,null,null,null,null,null,null,null,null,null,null,null,{"$f":"J101+O101","v":0}]
[null,null,null,null,null,null,null,null,null,null,null,null,null,null,null,{"$f":"J102+O102","v":0}]
[null,null,null,null,null,null,null,null,null,null,null,null,null,null,null,{"$f":"J103+O103","v":0}]
[null,null,null,null,null,null,null,null,null,null,null,null,null,null,null,{"$f":"J104+O104","v":0}]
[null,null,null,null,null,null,null,null,null,null,null,null,null,null,null,{"$f":"J105+O105","v":0}]
[null,null,null,null,null,null,null,null,null,null,null,null,null,null,null,{"$f":"J106+O106","v":0}]
[null,null,null,null,null,null,null,null,null,null,null,null,null,null,null,{"$f":"J107+O107","v":0}]
[null,null,null,null,null,null,null,null,null,null,null,null,null,null,null,{"$f":"J108+O108","v":0}]
[null,null,null,null,null,null,null,null,null,null,null,null,null,null,null,{"$f":"J109+O109","v":0}]
[null,null,null,null,null,null,null,null,null,null,null,null,null,null,null,{"$f":"J110+O110","v":0}]
[null,null,null,null,null,null,null,null,null,null,null,null,null,null,null,{"$f":"J111+O111","v":0}]
[null,null,null,null,null,null,null,null,null,null,null,null,null,null,null,{"$f":"J112+O112","v":0}]
[null,null,null,null,null,null,null,null,null,null,null,null,null,null,null,{"$f":"J113+O113","v":0}]
[null,null,null,null,null,null,null,null,null,null,null,null,null,null,null,{"$f":"J114+O114","v":0}]
[null,null,null,null,null,null,null,null,null,null,null,null,null,null,null,{"$f":"J115+O115","v":0}]
[null,null,null,null,null,null,null,null,null,null,null,null,null,null,null,{"$f":"J116+O116","v":0}]
[null,null,null,null,null,null,null,null,null,null,null,null,null,null,null,{"$f":"J117+O117","v":0}]
[null,null,null,null,null,null,null,null,null,null,null,null,null,null,null,{"$f":"J118+O118","v":0}]
[null,null,null,null,null,null,null,null,null,null,null,null,null,null,null,{"$f":"J119+O119","v":0}]
[null,null,null,null,null,null,null,null,null,null,null,null,null,null,null,{"$f":"J120+O120","v":0}]
[null,null,null,null,null,null,null,null,null,null,null,null,null,null,null,{"$f":"J121+O121","v":0}]
[null,null,null,null,null,null,null,null,null,null,null,null,null,null,null,{"$f":"J122+O122","v":0}]
[null,null,null,null,null,null,null,null,null,null,null,null,null,null,null,{"$f":"J123+O123","v":0}]
[null,null,null,null,null,null,null,null,null,null,null,null,null,null,null,{"$f":"J124+O124","v":0}]
[null,null,null,null,null,null,null,null,null,null,null,null,null,null,null,{"$f":"J125+O125","v":0}]
[null,null,null,null,null,null,null,null,null,null,null,null,null,null,null,{"$f":"J126+O126","v":0}]
[null,null,null,null,null,null,null,null,null,null,null,null,null,null,null,{"$f":"J127+O127","v":0}]
[null,null,null,null,null,null,null,null,null,null,null,null,null,null,null,{"$f":"J128+O128","v":0}]
[null,null,null,null,null,null,null,null,null,null,null,null,null,null,null,{"$f":"J129+O129","v":0}]
[null,null,null,null,null,null,null,null,null,null,null,null,null,null,null,{"$f":"J130+O130","v":0}]
[null,null,null,null,null,null,null,null,null,null,null,null,null,null,null,{"$f":"J131+O131","v":0}]
[null,null,null,null,null,null,null,null,null,null,null,null,null,null,null,{"$f":"J132+O132","v":0}]
[null,null,null,null,null,null,null,null,null,null,null,null,null,null,null,{"$f":"J133+O133","v":0}]
[null,null,null,null,null,null,null,null,null,null,null,null,null,null,null,{"$f":"J134+O134","v":0}]
[null,null,null,null,null,null,null,null,null,null,null,null,null,null,null,{"$f":"J135+O135","v":0}]
[null,null,null,null,null,null,null,null,null,null,null,null,null,null,null,{"$f":"J136+O136","v":0}]
[null,null,null,null,null,null,null,null,null,null,null,null,null,null,null,{"$f":"J137+O137","v":0}]
[null,null,null,null,null,null,null,null,null,null,null,null,null,null,null,{"$f":"J138+O138","v":0}]
[null,null,null,null,null,null,null,null,null,null,null,null,null,null,null,{"$f":"J139+O139","v":0}]
[null,null,null,null,null,null,null,null,null,null,null,null,null,null,null,{"$f":"J140+O140","v":0}]
[null,null,null,null,null,null,null,null,null,null,null,null,null,null,null,{"$f":"J141+O141","v":0}]
[null,null,null,null,null,null,null,null,null,null,null,null,null,null,null,{"$f":"J142+O142","v":0}]
[null,null,null,null,null,null,null,null,null,null,null,null,null,null,null,{"$f":"J143+O143","v":0}]
[null,null,null,null,null,null,null,null,null,null,null,null,null,null,null,{"$f":"J144+O144","v":0}]
[null,null,null,null,null,null,null,null,null,null,null,null,null,null,null,{"$f":"J145+O145","v":0}]
[null,null,null,null,null,null,null,null,null,null,null,null,null,null,null,{"$f":"J146+O146","v":0}]
[null,null,null,null,null,null,null,null,null,null,null,null,null,null,null,{"$f":"J147+O147","v":0}]
[null,null,null,null,null,null,null,null,null,null,null,null,null,null,null,{"$f":"J148+O148","v":0}]
[null,null,null,null,null,null,null,null,null,null,null,null,null,null,null,{"$f":"J149+O149","v":0}]
[null,null,null,null,null,null,null,null,null,null,null,null,null,null,null,{"$f":"J150+O150","v":0}]
[null,null,null,null,null,null,null,null,null,null,null,null,null,null,null,{"$f":"J151+O151","v":0}]
[null,null,null,null,null,null,null,null,null,null,null,null,null,null,null,{"$f":"J152+O152","v":0}]
[null,null,null,null,null,null,null,null,null,null,null,null,null,null,null,{"$f":"J153+O153","v":0}]
[null,null,null,null,null,null,null,null,null,null,null,null,null,null,null,{"$f":"J154+O154","v":0}]
[null,null,null,null,null,null,null,null,null,null,null,null,null,null,null,{"$f":"J155+O155","v":0}]
[null,null,null,null,null,null,null,null,null,null,null,null,null,null,null,{"$f":"J156+O156","v":0}]
[null,null,null,null,null,null,null,null,null,null,null,null,null,null,null,{"$f":"J157+O157","v":0}]
[null,null,null,null,null,null,null,null,null,null,null,null,null,null,null,{"$f":"J158+O158","v":0}]
[null,null,null,null,null,null,null,null,null,null,null,null,null,null,null,{"$f":"J159+O159","v":0}]
[null,null,null,null,null,null,null,null,null,null,null,null,null,null,null,{"$f":"J160+O160","v":0}]
[null,null,null,null,null,null,null,null,null,null,null,null,null,null,null,{"$f":"J161+O161","v":0}]
[null,null,null,null,null,null,null,null,null,null,null,null,null,null,null,{"$f":"J162+O162","v":0}]
[null,null,null,null,null,null,null,null,null,null,null,null,null,null,null,{"$f":"J163+O163","v":0}]
[null,null,null,null,null,null,null,null,null,null,null,null,null,null,null,{"$f":"J164+O164","v":0}]
[null,null,null,null,null,null,null,null,null,null,null,null,null,null,null,{"$f":"J165+O165","v":0}]
[null,null,null,null,null,null,null,null,null,null,null,null,null,null,null,{"$f":"J166+O166","v":0}]
[null,null,null,null,null,null,null,null,null,null,null,null,null,null,null,{"$f":"J167+O167","v":0}]
[null,null,null,null,null,null,null,null,null,null,null,null,null,null,null,{"$f":"J168+O168","v":0}]
[null,null,null,null,null,null,null,null,null,null,null,null,null,null,null,{"$f":"J169+O169","v":0}]
[null,null,null,null,null,null,null,null,null,null,null,null,null,null,null,{"$f":"J170+O170","v":0}]
[null,null,null,null,null,null,null,null,null,null,null,null,null,null,null,{"$f":"J171+O171","v":0}]
[null,null,null,null,null,null,null,null,null,null,null,null,null,null,null,{"$f":"J172+O172","v":0}]
[null,null,null,null,null,null,null,null,null,null,null,null,null,null,null,{"$f":"J173+O173","v":0}]
[null,null,null,null,null,null,null,null,null,null,null,null,null,null,null,{"$f":"J174+O174","v":0}]
[null,null,null,null,null,null,null,null,null,null,null,null,null,null,null,{"$f":"J175+O175","v":0}]
[null,null,null,null,null,null,null,null,null,null,null,null,null,null,null,{"$f":"J176+O176","v":0}]
[null,null,null,null,null,null,null,null,null,null,null,null,null,null,null,{"$f":"J177+O177","v":0}]
[null,null,null,null,null,null,null,null,null,null,null,null,null,null,null,{"$f":"J178+O178","v":0}]
[null,null,null,null,null,null,null,null,null,null,null,null,null,null,null,{"$f":"J179+O179","v":0}]
[null,null,null,null,null,null,null,null,null,null,null,null,null,null,null,{"$f":"J180+O180","v":0}]
[null,null,null,null,null,null,null,null,null,null,null,null,null,null,null,{"$f":"J181+O181","v":0}]
[null,null,null,null,null,null,null,null,null,null,null,null,null,null,null,{"$f":"J182+O182","v":0}]
[null,null,null,null,null,null,null,null,null,null,null,null,null,null,null,{"$f":"J183+O183","v":0}]
[null,null,null,null,null,null,null,null,null,null,null,null,null,null,null,{"$f":"J184+O184","v":0}]
[null,null,null,null,null,null,null,null,null,null,null,null,null,null,null,{"$f":"J185+O185","v":0}]
[null,null,null,null,null,null,null,null,null,null,null,null,null,null,null,{"$f":"J186+O186","v":0}]
[null,null,null,null,null,null,null,null,null,null,null,null,null,null,null,{"$f":"J187+O187","v":0}]
[null,null,null,null,null,null,null,null,null,null,null,null,null,null,null,{"$f":"J188+O188","v":0}]
[null,null,null,null,null,null,null,null,null,null,null,null,null,null,null,{"$f":"J189+O189","v":0}]
[null,null,null,null,null,null,null,null,null,null,null,null,null,null,null,{"$f":"J190+O190","v":0}]
[null,null,null,null,null,null,null,null,null,null,null,null,null,null,null,{"$f":"J191+O191","v":0}]
[null,null,null,null,null,null,null,null,null,null,null,null,null,null,null,{"$f":"J192+O192","v":0}]
[null,null,null,null,null,null,null,null,null,null,null,null,null,null,null,{"$f":"J193+O193","v":0}]
[null,null,null,null,null,null,null,null,null,null,null,null,null,null,null,{"$f":"J194+O194","v":0}]
[null,null,null,null,null,null,null,null,null,null,null,null,null,null,null,{"$f":"J195+O195","v":0}]
[null,null,null,null,null,null,null,null,null,null,null,null,null,null,null,{"$f":"J196+O196","v":0}]
[null,null,null,null,null,null,null,null,null,null,null,null,null,null,null,{"$f":"J197+O197","v":0}]
[null,null,null,null,null,null,null,null,null,null,null,null,null,null,null,{"$f":"J198+O198","v":0}]
[null,null,null,null,null,null,null,null,null,null,null,null,null,null,null,{"$f":"J199+O199","v":0}]
[null,null,null,null,null,null,null,null,null,null,null,null,null,null,null,{"$f":"J200+O200","v":0}]
[null,null,null,null,null,null,null,null,null,null,null,null,null,null,null,{"$f":"J201+O201","v":0}]
[null,null,null,null,null,null,null,null,null,null,null,null,null,null,null,{"$f":"J202+O202","v":0}]
[null,null,null,null,null,null,null,null,null,null,null,null,null,null,null,{"$f":"J203+O203","v":0}]
[null,null,null,null,null,null,null,null,null,null,null,null,null,null,null,{"$f":"J204+O204","v":0}]
[null,null,null,null,null,null,null,null,null,null,null,null,null,null,null,{"$f":"J205+O205","v":0}]
[null,null,null,null,null,null,null,null,null,null,null,null,null,null,null,{"$f":"J206+O206","v":0}]
[null,null,null,null,null,null,null,null,null,null,null,null,null,null,null,{"$f":"J207+O207","v":0}]
[null,null,null,null,null,null,null,null,null,null,null,null,null,null,null,{"$f":"J208+O208","v":0}]
[null,null,null,null,null,null,null,null,null,null,null,null,null,null,null,{"$f":"J209+O209","v":0}]
[null,null,null,null,null,null,null,null,null,null,null,null,null,null,null,{"$f":"J210+O210","v":0}]
[null,null,null,null,null,null,null,null,null,null,null,null,null,null,null,{"$f":"J211+O211","v":0}]
[null,null,null,null,null,null,null,null,null,null,null,null,null,null,null,{"$f":"J212+O212","v":0}]
[null,null,null,null,null,null,null,null,null,null,null,null,null,null,null,{"$f":"J213+O213","v":0}]
[null,null,null,null,null,null,null,null,null,null,null,null,null,null,null,{"$f":"J214+O214","v":0}]
[null,null,null,null,null,null,null,null,null,null,null,null,null,null,null,{"$f":"J215+O215","v":0}]
[null,null,null,null,null,null,null,null,null,null,null,null,null,null,null,{"$f":"J216+O216","v":0}]
[null,null,null,null,null,null,null,null,null,null,null,null,null,null,null,{"$f":"J217+O217","v":0}]
[null,null,null,null,null,null,null,null,null,null,null,null,null,null,null,{"$f":"J218+O218","v":0}]
[null,null,null,null,null,null,null,null,null,null,null,null,null,null,null,{"$f":"J219+O219","v":0}]
[null,null,null,null,null,null,null,null,null,null,null,null,null,null,null,{"$f":"J220+O220","v":0}]
[null,null,null,null,null,null,null,null,null,null,null,null,null,null,null,{"$f":"J221+O221","v":0}]
[null,null,null,null,null,null,null,null,null,null,null,null,null,null,null,{"$f":"J222+O222","v":0}]
[null,null,null,null,null,null,null,null,null,null,null,null,null,null,null,{"$f":"J223+O223","v":0}]
[null,null,null,null,null,null,null,null,null,null,null,null,null,null,null,{"$f":"J224+O224","v":0}]
[null,null,null,null,null,null,null,null,null,null,null,null,null,null,null,{"$f":"J225+O225","v":0}]
[null,null,null,null,null,null,null,null,null,null,null,null,null,null,null,{"$f":"J226+O226","v":0}]
[null,null,null,null,null,null,null,null,null,null,null,null,null,null,null,{"$f":"J227+O227","v":0}]
[null,null,null,null,null,null,null,null,null,null,null,null,null,null,null,{"$f":"J228+O228","v":0}]
[null,null,null,null,null,null,null,null,null,null,null,null,null,null,null,{"$f":"J229+O229","v":0}]
[null,null,null,null,null,null,null,null,null,null,null,null,null,null,null,{"$f":"J230+O230","v":0}]
[null,null,null,null,null,null,null,null,null,null,null,null,null,null,null,{"$f":"J231+O231","v":0}]
[null,null,null,null,null,null,null,null,null,null,null,null,null,null,null,{"$f":"J232+O232","v":0}]
[null,null,null,null,null,null,null,null,null,null,null,null,null,null,null,{"$f":"J233+O233","v":0}]
[null,null,null,null,null,null,null,null,null,null,null,null,null,null,null,{"$f":"J234+O234","v":0}]
[null,null,null,null,null,null,null,null,null,null,null,null,null,null,null,{"$f":"J235+O235","v":0}]
[null,null,null,null,null,null,null,null,null,null,null,null,null,null,null,{"$f":"J236+O236","v":0}]
[null,null,null,null,null,null,null,null,null,null,null,null,null,null,null,{"$f":"J237+O237","v":0}]
[null,null,null,null,null,null,null,null,null,null,null,null,null,null,null,{"$f":"J238+O238","v":0}]
[null,null,null,null,null,null,null,null,null,null,null,null,null,null,null,{"$f":"J239+O239","v":0}]
[null,null,null,null,null,null,null,null,null,null,null,null,null,null,null,{"$f":"J240+O240","v":0}]
[null,null,null,null,null,null,null,null,null,null,null,null,null,null,null,{"$f":"J241+O241","v":0}]
[null,null,null,null,null,null,null,null,null,null,null,null,null,null,null,{"$f":"J242+O242","v":0}]
[null,null,null,null,null,null,null,null,null,null,null,null,null,null,null,{"$f":"J243+O243","v":0}]
[null,null,null,null,null,null,null,null,null,null,null,null,null,null,null,{"$f":"J244+O244","v":0}]
[null,null,null,null,null,null,null,null,null,null,null,null,null,null,null,{"$f":"J245+O245","v":0}]
[null,null,null,null,null,null,null,null,null,null,null,null,null,null,null,{"$f":"J246+O246","v":0}]
[null,null,null,null,null,null,null,null,null,null,null,null,null,null,null,{"$f":"J247+O247","v":0}]
[null,null,null,null,null,null,null,null,null,null,null,null,null,null,null,{"$f":"J248+O248","v":0}]
[null,null,null,null,null,null,null,null,null,null,null,null,null,null,null,{"$f":"J249+O249","v":0}]
[null,null,null,null,null,null,null,null,null,null,null,null,null,null,null,{"$f":"J250+O250","v":0}]
[null,null,null,null,null,null,null,null,null,null,null,null,null,null,null,{"$f":"J251+O251","v":0}]
[null,null,null,null,null,null,null,null,null,null,null,null,null,null,null,{"$f":"J252+O252","v":0}]
[null,null,null,null,null,null,null,null,null,null,null,null,null,null,null,{"$f":"J253+O253","v":0}]
[null,null,null,null,null,null,null,null,null,null,null,null,null,null,null,{"$f":"J254+O254","v":0}]
[null,null,null,null,null,null,null,null,null,null,null,null,null,null,null,{"$f":"J255+O255","v":0}]
[null,null,null,null,null,null,null,null,null,null,null,null,null,null,null,{"$f":"J256+O256","v":0}]
[null,null,null,null,null,null,null,null,null,null,null,null,null,null,null,{"$f":"J257+O257","v":0}]
[null,null,null,null,null,null,null,null,null,null,null,null,null,null,null,{"$f":"J258+O258","v":0}]
[null,null,null,null,null,null,null,null,null,null,null,null,null,null,null,{"$f":"J259+O259","v":0}]
[null,null,null,null,null,null,null,null,null,null,null,null,null,null,null,{"$f":"J260+O260","v":0}]
[null,null,null,null,null,null,null,null,null,null,null,null,null,null,null,{"$f":"J261+O261","v":0}]
[null,null,null,null,null,null,null,null,null,null,null,null,null,null,null,{"$f":"J262+O262","v":0}]
[null,null,null,null,null,null,null,null,null,null,null,null,null,null,null,{"$f":"J263+O263","v":0}]
[null,null,null,null,null,null,null,null,null,null,null,null,null,null,null,{"$f":"J264+O264","v":0}]
[null,null,null,null,null,null,null,null,null,null,null,null,null,null,null,{"$f":"J265+O265","v":0}]
[null,null,null,null,null,null,null,null,null,null,null,null,null,null,null,{"$f":"J266+O266","v":0}]
[null,null,null,null,null,null,null,null,null,null,null,null,null,null,null,{"$f":"J267+O267","v":0}]
[null,null,null,null,null,null,null,null,null,null,null,null,null,null,null,{"$f":"J268+O268","v":0}]
[null,null,null,null,null,null,null,null,null,null,null,null,null,null,null,{"$f":"J269+O269","v":0}]
[null,null,null,null,null,null,null,null,null,null,null,null,null,null,null,{"$f":"J270+O270","v":0}]
[null,null,null,null,null,null,null,null,null,null,null,null,null,null,null,{"$f":"J271+O271","v":0}]
[null,null,null,null,null,null,null,null,null,null,null,null,null,null,null,{"$f":"J272+O272","v":0}]
[null,null,null,null,null,null,null,null,null,null,null,null,null,null,null,{"$f":"J273+O273","v":0}]
[null,null,null,null,null,null,null,null,null,null,null,null,null,null,null,{"$f":"J274+O274","v":0}]
[null,null,null,null,null,null,null,null,null,null,null,null,null,null,null,{"$f":"J275+O275","v":0}]
[null,null,null,null,null,null,null,null,null,null,null,null,null,null,null,{"$f":"J276+O276","v":0}]
[null,null,null,null,null,null,null,null,null,null,null,null,null,null,null,{"$f":"J277+O277","v":0}]
[null,null,null,null,null,null,null,null,null,null,null,null,null,null,null,{"$f":"J278+O278","v":0}]
[null,null,null,null,null,null,null,null,null,null,null,null,null,null,null,{"$f":"J279+O279","v":0}]
[null,null,null,null,null,null,null,null,null,null,null,null,null,null,null,{"$f":"J280+O280","v":0}]
[null,null,null,null,null,null,null,null,null,null,null,null,null,null,null,{"$f":"J281+O281","v":0}]
[null,null,null,null,null,null,null,null,null,null,null,null,null,null,null,{"$f":"J282+O282","v":0}]
[null,null,null,null,null,null,null,null,null,null,null,null,null,null,null,{"$f":"J283+O283","v":0}]
[null,null,null,null,null,null,null,null,null,null,null,null,null,null,null,{"$f":"J284+O284","v":0}]
[null,null,null,null,null,null,null,null,null,null,null,null,null,null,null,{"$f":"J285+O285","v":0}]
[null,null,null,null,null,null,null,null,null,null,null,null,null,null,null,{"$f":"J286+O286","v":0}]
[null,null,null,null,null,null,null,null,null,null,null,null,null,null,null,{"$f":"J287+O287","v":0}]
[null,null,null,null,null,null,null,null,null,null,null,null,null,null,null,{"$f":"J288+O288","v":0}]
[null,null,null,null,null,null,null,null,null,null,null,null,null,null,null,{"$f":"J289+O289","v":0}]
[null,null,null,null,null,null,null,null,null,null,null,null,null,null,null,{"$f":"J290+O290","v":0}]
[null,null,null,null,null,null,null,null,null,null,null,null,null,null,null,{"$f":"J291+O291","v":0}]
[null,null,null,null,null,null,null,null,null,null,null,null,null,null,null,{"$f":"J292+O292","v":0}]
[null,null,null,null,null,null,null,null,null,null,null,null,null,null,null,{"$f":"J293+O293","v":0}]
[null,null,null,null,null,null,null,null,null,null,null,null,null,null,null,{"$f":"J294+O294","v":0}]
[null,null,null,null,null,null,null,null,null,null,null,null,null,null,null,{"$f":"J295+O295","v":0}]
[null,null,null,null,null,null,null,null,null,null,null,null,null,null,null,{"$f":"J296+O296","v":0}]
[null,null,null,null,null,null,null,null,null,null,null,null,null,null,null,{"$f":"J297+O297","v":0}]
[null,null,null,null,null,null,null,null,null,null,null,null,null,null,null,{"$f":"J298+O298","v":0}]
[null,null,null,null,null,null,null,null,null,null,null,null,null,null,null,{"$f":"J299+O299","v":0}]
[null,null,null,null,null,null,null,null,null,null,null,null,null,null,null,{"$f":"J300+O300","v":0}]
[null,null,null,null,null,null,null,null,null,null,null,null,null,null,null,{"$f":"J301+O301","v":0}]
[null,null,null,null,null,null,null,null,null,null,null,null,null,null,null,{"$f":"J302+O302","v":0}]
[null,null,null,null,null,null,null,null,null,null,null,null,null,null,null,{"$f":"J303+O303","v":0}]
[null,null,null,null,null,null,null,null,null,null,null,null,null,null,null,{"$f":"J304+O304","v":0}]
[null,null,null,null,null,null,null,null,null,null,null,null,null,null,null,{"$f":"J305+O305","v":0}]
[null,null,null,null,null,null,null,null,null,null,null,null,null,null,null,{"$f":"J306+O306","v":0}]
[null,null,null,null,null,null,null,null,null,null,null,null,null,null,null,{"$f":"J307+O307","v":0}]
[null,null,null,null,null,null,null,null,null,null,null,null,null,null,null,{"$f":"J308+O308","v":0}]
[null,null,null,null,null,null,null,null,null,null,null,null,null,null,null,{"$f":"J309+O309","v":0}]
[null,null,null,null,null,null,null,null,null,null,null,null,null,null,null,{"$f":"J310+O310","v":0}]
[null,null,null,null,null,null,null,null,null,null,null,null,null,null,null,{"$f":"J311+O311","v":0}]
[null,null,null,null,null,null,null,null,null,null,null,null,null,null,null,{"$f":"J312+O312","v":0}]
[null,null,null,null,null,null,null,null,null,null,null,null,null,null,null,{"$f":"J313+O313","v":0}]
[null,null,null,null,null,null,null,null,null,null,null,null,null,null,null,{"$f":"J314+O314","v":0}]
[null,null,null,null,null,null,null,null,null,null,null,null,null,null,null,{"$f":"J315+O315","v":0}]
[null,null,null,null,null,null,null,null,null,null,null,null,null,null,null,{"$f":"J316+O316","v":0}]
[null,null,null,null,null,null,null,null,null,null,null,null,null,null,null,{"$f":"J317+O317","v":0}]
[null,null,null,null,null,null,null,null,null,null,null,null,null,null,null,{"$f":"J318+O318","v":0}]
[null,null,null,null,null,null,null,null,null,null,null,null,null,null,null,{"$f":"J319+O319","v":0}]
[null,null,null,null,null,null,null,null,null,null,null,null,null,null,null,{"$f":"J320+O320","v":0}]
[null,null,null,null,null,null,null,null,null,null,null,null,null,null,null,{"$f":"J321+O321","v":0}]
[null,null,null,null,null,null,null,null,null,null,null,null,null,null,null,{"$f":"J322+O322","v":0}]
[null,null,null,null,null,null,null,null,null,null,null,null,null,null,null,{"$f":"J323+O323","v":0}]
[null,null,null,null,null,null,null,null,null,null,null,null,null,null,null,{"$f":"J324+O324","v":0}]
[null,null,null,null,null,null,null,null,null,null,null,null,null,null,null,{"$f":"J325+O325","v":0}]
[null,null,null,null,null,null,null,null,null,null,null,null,null,null,null,{"$f":"J326+O326","v":0}]
[null,null,null,null,null,null,null,null,null,null,null,null,null,null,null,{"$f":"J327+O327","v":0}]
[null,null,null,null,null,null,null,null,null,null,null,null,null,null,null,{"$f":"J328+O328","v":0}]
[null,null,null,null,null,null,null,null,null,null,null,null,null,null,null,{"$f":"J329+O329","v":0}]
[null,null,null,null,null,null,null,null,null,null,null,null,null,null,null,{"$f":"J330+O330","v":0}]
[null,null,null,null,null,null,null,null,null,null,null,null,null,null,null,{"$f":"J331+O331","v":0}]
[null,null,null,null,null,null,null,null,null,null,null,null,null,null,null,{"$f":"J332+O332","v":0}]
[null,null,null,null,null,null,null,null,null,null,null,null,null,null,null,{"$f":"J333+O333","v":0}]
[null,null,null,null,null,null,null,null,null,null,null,null,null,null,null,{"$f":"J334+O334","v":0}]
[null,null,null,null,null,null,null,null,null,null,null,null,null,null,null,{"$f":"J335+O335","v":0}]
[null,null,null,null,null,null,null,null,null,null,null,null,null,null,null,{"$f":"J336+O336","v":0}]
[null,null,null,null,null,null,null,null,null,null,null,null,null,null,null,{"$f":"J337+O337","v":0}]
[null,null,null,null,null,null,null,null,null,null,null,null,null,null,null,{"$f":"J338+O338","v":0}]
[null,null,null,null,null,null,null,null,null,null,null,null,null,null,null,{"$f":"J339+O339","v":0}]
[null,null,null,null,null,null,null,null,null,null,null,null,null,null,null,{"$f":"J340+O340","v":0}]
[null,null,null,null,null,null,null,null,null,null,null,null,null,null,null,{"$f":"J341+O341","v":0}]
[null,null,null,null,null,null,null,null,null,null,null,null,null,null,null,{"$f":"J342+O342","v":0}]
[null,null,null,null,null,null,null,null,null,null,null,null,null,null,null,{"$f":"J343+O343","v":0}]
[null,null,null,null,null,null,null,null,null,null,null,null,null,null,null,{"$f":"J344+O344","v":0}]
[null,null,null,null,null,null,null,null,null,null,null,null,null,null,null,{"$f":"J345+O345","v":0}]
[null,null,null,null,null,null,null,null,null,null,null,null,null,null,null,{"$f":"J346+O346","v":0}]
[null,null,null,null,null,null,null,null,null,null,null,null,null,null,null,{"$f":"J347+O347","v":0}]
[null,null,null,null,null,null,null,null,null,null,null,null,null,null,null,{"$f":"J348+O348","v":0}]
[null,null,null,null,null,null,null,null,null,null,null,null,null,null,null,{"$f":"J349+O349","v":0}]
[null,null,null,null,null,null,null,null,null,null,null,null,null,null,null,{"$f":"J350+O350","v":0}]
[null,null,null,null,null,null,null,null,null,null,null,null,null,null,null,{"$f":"J351+O351","v":0}]
[null,null,null,null,null,null,null,null,null,null,null,null,null,null,null,{"$f":"J352+O352","v":0}]
[null,null,null,null,null,null,null,null,null,null,null,null,null,null,null,{"$f":"J353+O353","v":0}]
[null,null,null,null,null,null,null,null,null,null,null,null,null,null,null,{"$f":"J354+O354","v":0}]
[null,null,null,null,null,null,null,null,null,null,null,null,null,null,null,{"$f":"J355+O355","v":0}]
[null,null,null,null,null,null,null,null,null,null,null,null,null,null,null,{"$f":"J356+O356","v":0}]
[null,null,null,null,null,null,null,null,null,null,null,null,null,null,null,{"$f":"J357+O357","v":0}]
[null,null,null,null,null,null,null,null,null,null,null,null,null,null,null,{"$f":"J358+O358","v":0}]
[null,null,null,null,null,null,null,null,null,null,null,null,null,null,null,{"$f":"J359+O359","v":0}]
[null,null,null,null,null,null,null,null,null,null,null,null,null,null,null,{"$f":"J360+O360","v":0}]
[null,null,null,null,null,null,null,null,null,null,null,null,null,null,null,{"$f":"J361+O361","v":0}]
[null,null,null,null,null,null,null,null,null,null,null,null,null,null,null,{"$f":"J362+O362","v":0}]
[null,null,null,null,null,null,null,null,null,null,null,null,null,null,null,{"$f":"J363+O363","v":0}]
[null,null,null,null,null,null,null,null,null,null,null,null,null,null,null,{"$f":"J364+O364","v":0}]
[null,null,null,null,null,null,null,null,null,null,null,null,null,null,null,{"$f":"J365+O365","v":0}]
[null,null,null,null,null,null,null,null,null,null,null,null,null,null,null,{"$f":"J366+O366","v":0}]
[null,null,null,null,null,null,null,null,null,null,null,null,null,null,null,{"$f":"J367+O367","v":0}]
[null,null,null,null,null,null,null,null,null,null,null,null,null,null,null,{"$f":"J368+O368","v":0}]
[null,null,null,null,null,null,null,null,null,null,null,null,null,null,null,{"$f":"J369+O369","v":0}]
[null,null,null,null,null,null,null,null,null,null,null,null,null,null,null,{"$f":"J370+O370","v":0}]
[null,null,null,null,null,null,null,null,null,null,null,null,null,null,null,{"$f":"J371+O371","v":0}]
[null,null,null,null,null,null,null,null,null,null,null,null,null,null,null,{"$f":"J372+O372","v":0}]
[null,null,null,null,null,null,null,null,null,null,null,null,null,null,null,{"$f":"J373+O373","v":0}]
[null,null,null,null,null,null,null,null,null,null,null,null,null,null,null,{"$f":"J374+O374","v":0}]
[null,null,null,null,null,null,null,null,null,null,null,null,null,null,null,{"$f":"J375+O375","v":0}]
[null,null,null,null,null,null,null,null,null,null,null,null,null,null,null,{"$f":"J376+O376","v":0}]
[null,null,null,null,null,null,null,null,null,null,null,null,null,null,null,{"$f":"J377+O377","v":0}]
[null,null,null,null,null,null,null,null,null,null,null,null,null,null,null,{"$f":"J378+O378","v":0}]
[null,null,null,null,null,null,null,null,null,null,null,null,null,null,null,{"$f":"J379+O379","v":0}]
[null,null,null,null,null,null,null,null,null,null,null,null,null,null,null,{"$f":"J380+O380","v":0}]
[null,null,null,null,null,null,null,null,null,null,null,null,null,null,null,{"$f":"J381+O381","v":0}]
[null,null,null,null,null,null,null,null,null,null,null,null,null,null,null,{"$f":"J382+O382","v":0}]
[null,null,null,null,null,null,null,null,null,null,null,null,null,null,null,{"$f":"J383+O383","v":0}]
[null,null,null,null,null,null,null,null,null,null,null,null,null,null,null,{"$f":"J384+O384","v":0}]
[null,null,null,null,null,null,null,null,null,null,null,null,null,null,null,{"$f":"J385+O385","v":0}]
[null,null,null,null,null,null,null,null,null,null,null,null,null,null,null,{"$f":"J386+O386","v":0}]
[null,null,null,null,null,null,null,null,null,null,null,null,null,null,null,{"$f":"J387+O387","v":0}]
[null,null,null,null,null,null,null,null,null,null,null,null,null,null,null,{"$f":"J388+O388","v":0}]
[null,null,null,null,null,null,null,null,null,null,null,null,null,null,null,{"$f":"J389+O389","v":0}]
[null,null,null,null,null,null,null,null,null,null,null,null,null,null,null,{"$f":"J390+O390","v":0}]
[null,null,null,null,null,null,null,null,null,null,null,null,null,null,null,{"$f":"J391+O391","v":0}]
[null,null,null,null,null,null,null,null,null,null,null,null,null,null,null,{"$f":"J392+O392","v":0}]
[null,null,null,null,null,null,null,null,null,null,null,null,null,null,null,{"$f":"J393+O393","v":0}]
[null,null,null,null,null,null,null,null,null,null,null,null,null,null,null,{"$f":"J394+O394","v":0}]
[null,null,null,null,null,null,null,null,null,null,null,null,null,null,null,{"$f":"J395+O395","v":0}]
[null,null,null,null,null,null,null,null,null,null,null,null,null,null,null,{"$f":"J396+O396","v":0}]
[null,null,null,null,null,null,null,null,null,null,null,null,null,null,null,{"$f":"J397+O397","v":0}]
[null,null,null,null,null,null,null,null,null,null,null,null,null,null,null,{"$f":"J398+O398","v":0}]
[null,null,null,null,null,null,null,null,null,null,null,null,null,null,null,{"$f":"J399+O399","v":0}]
[null,null,null,null,null,null,null,null,null,null,null,null,null,null,null,{"$f":"J400+O400","v":0}]
[null,null,null,null,null,null,null,null,null,null,null,null,null,null,null,{"$f":"J401+O401","v":0}]
[null,null,null,null,null,null,null,null,null,null,null,null,null,null,null,{"$f":"J402+O402","v":0}]
[null,null,null,null,null,null,null,null,null,null,null,null,null,null,null,{"$f":"J403+O403","v":0}]
[null,null,null,null,null,null,null,null,null,null,null,null,null,null,null,{"$f":"J404+O404","v":0}]
[null,null,null,null,null,null,null,null,null,null,null,null,null,null,null,{"$f":"J405+O405","v":0}]
[null,null,null,null,null,null,null,null,null,null,null,null,null,null,null,{"$f":"J406+O406","v":0}]
[null,null,null,null,null,null,null,null,null,null,null,null,null,null,null,{"$f":"J407+O407","v":0}]
[null,null,null,null,null,null,null,null,null,null,null,null,null,null,null,{"$f":"J408+O408","v":0}]
[null,null,null,null,null,null,null,null,null,null,null,null,null,null,null,{"$f":"J409+O409","v":0}]
[null,null,null,null,null,null,null,null,null,null,null,null,null,null,null,{"$f":"J410+O410","v":0}]
[null,null,null,null,null,null,null,null,null,null,null,null,null,null,null,{"$f":"J411+O411","v":0}]
[null,null,null,null,null,null,null,null,null,null,null,null,null,null,null,{"$f":"J412+O412","v":0}]
[null,null,null,null,null,null,null,null,null,null,null,null,null,null,null,{"$f":"J413+O413","v":0}]
[null,null,null,null,null,null,null,null,null,null,null,null,null,null,null,{"$f":"J414+O414","v":0}]
[null,null,null,null,null,null,null,null,null,null,null,null,null,null,null,{"$f":"J415+O415","v":0}]
[null,null,null,null,null,null,null,null,null,null,null,null,null,null,null,{"$f":"J416+O416","v":0}]
[null,null,null,null,null,null,null,null,null,null,null,null,null,null,null,{"$f":"J417+O417","v":0}]
[null,null,null,null,null,null,null,null,null,null,null,null,null,null,null,{"$f":"J418+O418","v":0}]
[null,null,null,null,null,null,null,null,null,null,null,null,null,null,null,{"$f":"J419+O419","v":0}]
[null,null,null,null,null,null,null,null,null,null,null,null,null,null,null,{"$f":"J420+O420","v":0}]
[null,null,null,null,null,null,null,null,null,null,null,null,null,null,null,{"$f":"J421+O421","v":0}]
[null,null,null,null,null,null,null,null,null,null,null,null,null,null,null,{"$f":"J422+O422","v":0}]
[null,null,null,null,null,null,null,null,null,null,null,null,null,null,null,{"$f":"J423+O423","v":0}]
[null,null,null,null,null,null,null,null,null,null,null,null,null,null,null,{"$f":"J424+O424","v":0}]
[null,null,null,null,null,null,null,null,null,null,null,null,null,null,null,{"$f":"J425+O425","v":0}]
[null,null,null,null,null,null,null,null,null,null,null,null,null,null,null,{"$f":"J426+O426","v":0}]
[null,null,null,null,null,null,null,null,null,null,null,null,null,null,null,{"$f":"J427+O427","v":0}]
[null,null,null,null,null,null,null,null,null,null,null,null,null,null,null,{"$f":"J428+O428","v":0}]
[null,null,null,null,null,null,null,null,null,null,null,null,null,null,null,{"$f":"J429+O429","v":0}]
[null,null,null,null,null,null,null,null,null,null,null,null,null,null,null,{"$f":"J430+O430","v":0}]
[null,null,null,null,null,null,null,null,null,null,null,null,null,null,null,{"$f":"J431+O431","v":0}]
[null,null,null,null,null,null,null,null,null,null,null,null,null,null,null,{"$f":"J432+O432","v":0}]
[null,null,null,null,null,null,null,null,null,null,null,null,null,null,null,{"$f":"J433+O433","v":0}]
[null,null,null,null,null,null,null,null,null,null,null,null,null,null,null,{"$f":"J434+O434","v":0}]
[null,null,null,null,null,null,null,null,null,null,null,null,null,null,null,{"$f":"J435+O435","v":0}]
[null,null,null,null,null,null,null,null,null,null,null,null,null,null,null,{"$f":"J436+O436","v":0}]
[null,null,null,null,null,null,null,null,null,null,null,null,null,null,null,{"$f":"J437+O437","v":0}]
[null,null,null,null,null,null,null,null,null,null,null,null,null,null,null,{"$f":"J438+O438","v":0}]
[null,null,null,null,null,null,null,null,null,null,null,null,null,null,null,{"$f":"J439+O439","v":0}]
[null,null,null,null,null,null,null,null,null,null,null,null,null,null,null,{"$f":"J440+O440","v":0}]
[null,null,null,null,null,null,null,null,null,null,null,null,null,null,null,{"$f":"J441+O441","v":0}]
[null,null,null,null,null,null,null,null,null,null,null,null,null,null,null,{"$f":"J442+O442","v":0}]
[null,null,null,null,null,null,null,null,null,null,null,null,null,null,null,{"$f":"J443+O443","v":0}]
[null,null,null,null,null,null,null,null,null,null,null,null,null,null,null,{"$f":"J444+O444","v":0}]
[null,null,null,null,null,null,null,null,null,null,null,null,null,null,null,{"$f":"J445+O445","v":0}]
[null,null,null,null,null,null,null,null,null,null,null,null,null,null,null,{"$f":"J446+O446","v":0}]
[null,null,null,null,null,null,null,null,null,null,null,null,null,null,null,{"$f":"J447+O447","v":0}]
[null,null,null,null,null,null,null,null,null,null,null,null,null,null,null,{"$f":"J448+O448","v":0}]
[null,null,null,null,null,null,null,null,null,null,null,null,null,null,null,{"$f":"J449+O449","v":0}]
[null,null,null,null,null,null,null,null,null,null,null,null,null,null,null,{"$f":"J450+O450","v":0}]
[null,null,null,null,null,null,null,null,null,null,null,null,null,null,null,{"$f":"J451+O451","v":0}]
[null,null,null,null,null,null,null,null,null,null,null,null,null,null,null,{"$f":"J452+O452","v":0}]
[null,null,null,null,null,null,null,null,null,null,null,null,null,null,null,{"$f":"J453+O453","v":0}]
[null,null,null,null,null,null,null,null,null,null,null,null,null,null,null,{"$f":"J454+O454","v":0}]
[null,null,null,null,null,null,null,null,null,null,null,null,null,null,null,{"$f":"J455+O455","v":0}]
[null,null,null,null,null,null,null,null,null,null,null,null,null,null,null,{"$f":"J456+O456","v":0}]
[null,null,null,null,null,null,null,null,null,null,null,null,null,null,null,{"$f":"J457+O457","v":0}]
[null,null,null,null,null,null,null,null,null,null,null,null,null,null,null,{"$f":"J458+O458","v":0}]
[null,null,null,null,null,null,null,null,null,null,null,null,null,null,null,{"$f":"J459+O459","v":0}]
[null,null,null,null,null,null,null,null,null,null,null,null,null,null,null,{"$f":"J460+O460","v":0}]
[null,null,null,null,null,null,null,null,null,null,null,null,null,null,null,{"$f":"J461+O461","v":0}]
[null,null,null,null,null,null,null,null,null,null,null,null,null,null,null,{"$f":"J462+O462","v":0}]
[null,null,null,null,null,null,null,null,null,null,null,null,null,null,null,{"$f":"J463+O463","v":0}]
[null,null,null,null,null,null,null,null,null,null,null,null,null,null,null,{"$f":"J464+O464","v":0}]
[null,null,null,null,null,null,null,null,null,null,null,null,null,null,null,{"$f":"J465+O465","v":0}]
[null,null,null,null,null,null,null,null,null,null,null,null,null,null,null,{"$f":"J466+O466","v":0}]
[null,null,null,null,null,null,null,null,null,null,null,null,null,null,null,{"$f":"J467+O467","v":0}]
[null,null,null,null,null,null,null,null,null,null,null,null,null,null,null,{"$f":"J468+O468","v":0}]
[null,null,null,null,null,null,null,null,null,null,null,null,null,null,null,{"$f":"J469+O469","v":0}]
[null,null,null,null,null,null,null,null,null,null,null,null,null,null,null,{"$f":"J470+O470","v":0}]
[null,null,null,null,null,null,null,null,null,null,null,null,null,null,null,{"$f":"J471+O471","v":0}]
[null,null,null,null,null,null,null,null,null,null,null,null,null,null,null,{"$f":"J472+O472","v":0}]
[null,null,null,null,null,null,null,null,null,null,null,null,null,null,null,{"$f":"J473+O473","v":0}]
[null,null,null,null,null,null,null,null,null,null,null,null,null,null,null,{"$f":"J474+O474","v":0}]
[null,null,null,null,null,null,null,null,null,null,null,null,null,null,null,{"$f":"J475+O475","v":0}]
[null,null,null,null,null,null,null,null,null,null,null,null,null,null,null,{"$f":"J476+O476","v":0}]
[null,null,null,null,null,null,null,null,null,null,null,null,null,null,null,{"$f":"J477+O477","v":0}]
[null,null,null,null,null,null,null,null,null,null,null,null,null,null,null,{"$f":"J478+O478","v":0}]
[null,null,null,null,null,null,null,null,null,null,null,null,null,null,null,{"$f":"J479+O479","v":0}]
[null,null,null,null,null,null,null,null,null,null,null,null,null,null,null,{"$f":"J480+O480","v":0}]
[null,null,null,null,null,null,null,null,null,null,null,null,null,null,null,{"$f":"J481+O481","v":0}]
[null,null,null,null,null,null,null,null,null,null,null,null,null,null,null,{"$f":"J482+O482","v":0}]
[null,null,null,null,null,null,null,null,null,null,null,null,null,null,null,{"$f":"J483+O483","v":0}]
[null,null,null,null,null,null,null,null,null,null,null,null,null,null,null,{"$f":"J484+O484","v":0}]
[null,null,null,null,null,null,null,null,null,null,null,null,null,null,null,{"$f":"J485+O485","v":0}]
[null,null,null,null,null,null,null,null,null,null,null,null,null,null,null,{"$f":"J486+O486","v":0}]
[null,null,null,null,null,null,null,null,null,null,null,null,null,null,null,{"$f":"J487+O487","v":0}]
[null,null,null,null,null,null,null,null,null,null,null,null,null,null,null,{"$f":"J488+O488","v":0}]
[null,null,null,null,null,null,null,null,null,null,null,null,null,null,null,{"$f":"J489+O489","v":0}]
[null,null,null,null,null,null,null,null,null,null,null,null,null,null,null,{"$f":"J490+O490","v":0}]
[null,null,null,null,null,null,null,null,null,null,null,null,null,null,null,{"$f":"J491+O491","v":0}]
[null,null,null,null,null,null,null,null,null,null,null,null,null,null,null,{"$f":"J492+O492","v":0}]
[null,null,null,null,null,null,null,null,null,null,null,null,null,null,null,{"$f":"J493+O493","v":0}]
[null,null,null,null,null,null,null,null,null,null,null,null,null,null,null,{"$f":"J494+O494","v":0}]
[null,null,null,null,null,null,null,null,null,null,null,null,null,null,null,{"$f":"J495+O495","v":0}]
[null,null,null,null,null,null,null,null,null,null,null,null,null,null,null,{"$f":"J496+O496","v":0}]
[null,null,null,null,null,null,null,null,null,null,null,null,null,null,null,{"$f":"J497+O497","v":0}]
[null,null,null,null,null,null,null,null,null,null,null,null,null,null,null,{"$f":"J498+O498","v":0}]
[null,null,null,null,null,null,null,null,null,null,null,null,null,null,null,{"$f":"J499+O499","v":0}]
[null,null,null,null,null,null,null,null,null,null,null,null,null,null,null,{"$f":"J500+O500","v":0}]
[null,null,null,null,null,null,null,null,null,null,null,null,null,null,null,{"$f":"J501+O501","v":0}]
[null,null,null,null,null,null,null,null,null,null,null,null,null,null,null,{"$f":"J502+O502","v":0}]
[null,null,null,null,null,null,null,null,null,null,null,null,null,null,null,{"$f":"J503+O503","v":0}]
[null,null,null,null,null,null,null,null,null,null,null,null,null,null,null,{"$f":"J504+O504","v":0}]
[null,null,null,null,null,null,null,null,null,null,null,null,null,null,null,{"$f":"J505+O505","v":0}]
[null,null,null,null,null,null,null,null,null,null,null,null,null,null,null,{"$f":"J506+O506","v":0}]
[null,null,null,null,null,null,null,null,null,null,null,null,null,null,null,{"$f":"J507+O507","v":0}]
[null,null,null,null,null,null,null,null,null,null,null,null,null,null,null,{"$f":"J508+O508","v":0}]
[null,null,null,null,null,null,null,null,null,null,null,null,null,null,null,{"$f":"J509+O509","v":0}]
[null,null,null,null,null,null,null,null,null,null,null,null,null,null,null,{"$f":"J510+O510","v":0}]
[null,null,null,null,null,null,null,null,null,null,null,null,null,null,null,{"$f":"J511+O511","v":0}]
[null,null,null,null,null,null,null,null,null,null,null,null,null,null,null,{"$f":"J512+O512","v":0}]
[null,null,null,null,null,null,null,null,null,null,null,null,null,null,null,{"$f":"J513+O513","v":0}]
[null,null,null,null,null,null,null,null,null,null,null,null,null,null,null,{"$f":"J514+O514","v":0}]
[null,null,null,null,null,null,null,null,null,null,null,null,null,null,null,{"$f":"J515+O515","v":0}]
[null,null,null,null,null,null,null,null,null,null,null,null,null,null,null,{"$f":"J516+O516","v":0}]
[null,null,null,null,null,null,null,null,null,null,null,null,null,null,null,{"$f":"J517+O517","v":0}]
[null,null,null,null,null,null,null,null,null,null,null,null,null,null,null,{"$f":"J518+O518","v":0}]
[null,null,null,null,null,null,null,null,null,null,null,null,null,null,null,{"$f":"J519+O519","v":0}]
[null,null,null,null,null,null,null,null,null,null,null,null,null,null,null,{"$f":"J520+O520","v":0}]
[null,null,null,null,null,null,null,null,null,null,null,null,null,null,null,{"$f":"J521+O521","v":0}]
[null,null,null,null,null,null,null,null,null,null,null,null,null,null,null,{"$f":"J522+O522","v":0}]
[null,null,null,null,null,null,null,null,null,null,null,null,null,null,null,{"$f":"J523+O523","v":0}]
[null,null,null,null,null,null,null,null,null,null,null,null,null,null,null,{"$f":"J524+O524","v":0}]
[null,null,null,null,null,null,null,null,null,null,null,null,null,null,null,{"$f":"J525+O525","v":0}]
[null,null,null,null,null,null,null,null,null,null,null,null,null,null,null,{"$f":"J526+O526","v":0}]
[null,null,null,null,null,null,null,null,null,null,null,null,null,null,null,{"$f":"J527+O527","v":0}]
[null,null,null,null,null,null,null,null,null,null,null,null,null,null,null,{"$f":"J528+O528","v":0}]
[null,null,null,null,null,null,null,null,null,null,null,null,null,null,null,{"$f":"J529+O529","v":0}]
[null,null,null,null,null,null,null,null,null,null,null,null,null,null,null,{"$f":"J530+O530","v":0}]
[null,null,null,null,null,null,null,null,null,null,null,null,null,null,null,{"$f":"J531+O531","v":0}]
[null,null,null,null,null,null,null,null,null,null,null,null,null,null,null,{"$f":"J532+O532","v":0}]
[null,null,null,null,null,null,null,null,null,null,null,null,null,null,null,{"$f":"J533+O533","v":0}]
[null,null,null,null,null,null,null,null,null,null,null,null,null,null,null,{"$f":"J534+O534","v":0}]
[null,null,null,null,null,null,null,null,null,null,null,null,null,null,null,{"$f":"J535+O535","v":0}]
[null,null,null,null,null,null,null,null,null,null,null,null,null,null,null,{"$f":"J536+O536","v":0}]
[null,null,null,null,null,null,null,null,null,null,null,null,null,null,null,{"$f":"J537+O537","v":0}]
[null,null,null,null,null,null,null,null,null,null,null,null,null,null,null,{"$f":"J538+O538","v":0}]
[null,null,null,null,null,null,null,null,null,null,null,null,null,null,null,{"$f":"J539+O539","v":0}]
[null,null,null,null,null,null,null,null,null,null,null,null,null,null,null,{"$f":"J540+O540","v":0}]
[null,null,null,null,null,null,null,null,null,null,null,null,null,null,null,{"$f":"J541+O541","v":0}]
[null,null,null,null,null,null,null,null,null,null,null,null,null,null,null,{"$f":"J542+O542","v":0}]
[null,null,null,null,null,null,null,null,null,null,null,null,null,null,null,{"$f":"J543+O543","v":0}]
[null,null,null,null,null,null,null,null,null,null,null,null,null,null,null,{"$f":"J544+O544","v":0}]
[null,null,null,null,null,null,null,null,null,null,null,null,null,null,null,{"$f":"J545+O545","v":0}]
[null,null,null,null,null,null,null,null,null,null,null,null,null,null,null,{"$f":"J546+O546","v":0}]
[null,null,null,null,null,null,null,null,null,null,null,null,null,null,null,{"$f":"J547+O547","v":0}]
[null,null,null,null,null,null,null,null,null,null,null,null,null,null,null,{"$f":"J548+O548","v":0}]
[null,null,null,null,null,null,null,null,null,null,null,null,null,null,null,{"$f":"J549+O549","v":0}]
[null,null,null,null,null,null,null,null,null,null,null,null,null,null,null,{"$f":"J550+O550","v":0}]
[null,null,null,null,null,null,null,null,null,null,null,null,null,null,null,{"$f":"J551+O551","v":0}]
[null,null,null,null,null,null,null,null,null,null,null,null,null,null,null,{"$f":"J552+O552","v":0}]
[null,null,null,null,null,null,null,null,null,null,null,null,null,null,null,{"$f":"J553+O553","v":0}]
[null,null,null,null,null,null,null,null,null,null,null,null,null,null,null,{"$f":"J554+O554","v":0}]
[null,null,null,null,null,null,null,null,null,null,null,null,null,null,null,{"$f":"J555+O555","v":0}]
[null,null,null,null,null,null,null,null,null,null,null,null,null,null,null,{"$f":"J556+O556","v":0}]
[null,null,null,null,null,null,null,null,null,null,null,null,null,null,null,{"$f":"J557+O557","v":0}]
[null,null,null,null,null,null,null,null,null,null,null,null,null,null,null,{"$f":"J558+O558","v":0}]
[null,null,null,null,null,null,null,null,null,null,null,null,null,null,null,{"$f":"J559+O559","v":0}]
[null,null,null,null,null,null,null,null,null,null,null,null,null,null,null,{"$f":"J560+O560","v":0}]
[null,null,null,null,null,null,null,null,null,null,null,null,null,null,null,{"$f":"J561+O561","v":0}]
[null,null,null,null,null,null,null,null,null,null,null,null,null,null,null,{"$f":"J562+O562","v":0}]
[null,null,null,null,null,null,null,null,null,null,null,null,null,null,null,{"$f":"J563+O563","v":0}]
[null,null,null,null,null,null,null,null,null,null,null,null,null,null,null,{"$f":"J564+O564","v":0}]
[null,null,null,null,null,null,null,null,null,null,null,null,null,null,null,{"$f":"J565+O565","v":0}]
[null,null,null,null,null,null,null,null,null,null,null,null,null,null,null,{"$f":"J566+O566","v":0}]
[null,null,null,null,null,null,null,null,null,null,null,null,null,null,null,{"$f":"J567+O567","v":0}]
[null,null,null,null,null,null,null,null,null,null,null,null,null,null,null,{"$f":"J568+O568","v":0}]
[null,null,null,null,null,null,null,null,null,null,null,null,null,null,null,{"$f":"J569+O569","v":0}]
[null,null,null,null,null,null,null,null,null,null,null,null,null,null,null,{"$f":"J570+O570","v":0}]
[null,null,null,null,null,null,null,null,null,null,null,null,null,null,null,{"$f":"J571+O571","v":0}]
[null,null,null,null,null,null,null,null,null,null,null,null,null,null,null,{"$f":"J572+O572","v":0}]
[null,null,null,null,null,null,null,null,null,null,null,null,null,null,null,{"$f":"J573+O573","v":0}]
[null,null,null,null,null,null,null,null,null,null,null,null,null,null,null,{"$f":"J574+O574","v":0}]
[null,null,null,null,null,null,null,null,null,null,null,null,null,null,null,{"$f":"J575+O575","v":0}]
[null,null,null,null,null,null,null,null,null,null,null,null,null,null,null,{"$f":"J576+O576","v":0}]
[null,null,null,null,null,null,null,null,null,null,null,null,null,null,null,{"$f":"J577+O577","v":0}]
[null,null,null,null,null,null,null,null,null,null,null,null,null,null,null,{"$f":"J578+O578","v":0}]
[null,null,null,null,null,null,null,null,null,null,null,null,null,null,null,{"$f":"J579+O579","v":0}]
[null,null,null,null,null,null,null,null,null,null,null,null,null,null,null,{"$f":"J580+O580","v":0}]
[null,null,null,null,null,null,null,null,null,null,null,null,null,null,null,{"$f":"J581+O581","v":0}]
[null,null,null,null,null,null,null,null,null,null,null,null,null,null,null,{"$f":"J582+O582","v":0}]
[null,null,null,null,null,null,null,null,null,null,null,null,null,null,null,{"$f":"J583+O583","v":0}]
[null,null,null,null,null,null,null,null,null,null,null,null,null,null,null,{"$f":"J584+O584","v":0}]
[null,null,null,null,null,null,null,null,null,null,null,null,null,null,null,{"$f":"J585+O585","v":0}]
[null,null,null,null,null,null,null,null,null,null,null,null,null,null,null,{"$f":"J586+O586","v":0}]
[null,null,null,null,null,null,null,null,null,null,null,null,null,null,null,{"$f":"J587+O587","v":0}]
[null,null,null,null,null,null,null,null,null,null,null,null,null,null,null,{"$f":"J588+O588","v":0}]
[null,null,null,null,null,null,null,null,null,null,null,null,null,null,null,{"$f":"J589+O589","v":0}]
[null,null,null,null,null,null,null,null,null,null,null,null,null,null,null,{"$f":"J590+O590","v":0}]
[null,null,null,null,null,null,null,null,null,null,null,null,null,null,null,{"$f":"J591+O591","v":0}]
[null,null,null,null,null,null,null,null,null,null,null,null,null,null,null,{"$f":"J592+O592","v":0}]
[null,null,null,null,null,null,null,null,null,null,null,null,null,null,null,{"$f":"J593+O593","v":0}]
[null,null,null,null,null,null,null,null,null,null,null,null,null,null,null,{"$f":"J594+O594","v":0}]
[null,null,null,null,null,null,null,null,null,null,null,null,null,null,null,{"$f":"J595+O595","v":0}]
[null,null,null,null,null,null,null,null,null,null,null,null,null,null,null,{"$f":"J596+O596","v":0}]
[null,null,null,null,null,null,null,null,null,null,null,null,null,null,null,{"$f":"J597+O597","v":0}]
[null,null,null,null,null,null,null,null,null,null,null,null,null,null,null,{"$f":"J598+O598","v":0}]
[null,null,null,null,null,null,null,null,null,null,null,null,null,null,null,{"$f":"J599+O599","v":0}]
[null,null,null,null,null,null,null,null,null,null,null,null,null,null,null,{"$f":"J600+O600","v":0}]
[null,null,null,null,null,null,null,null,null,null,null,null,null,null,null,{"$f":"J601+O601","v":0}]
[null,null,null,null,null,null,null,null,null,null,null,null,null,null,null,{"$f":"J602+O602","v":0}]
[null,null,null,null,null,null,null,null,null,null,null,null,null,null,null,{"$f":"J603+O603","v":0}]
[null,null,null,null,null,null,null,null,null,null,null,null,null,null,null,{"$f":"J604+O604","v":0}]
[null,null,null,null,null,null,null,null,null,null,null,null,null,null,null,{"$f":"J605+O605","v":0}]
[null,null,null,null,null,null,null,null,null,null,null,null,null,null,null,{"$f":"J606+O606","v":0}]
[null,null,null,null,null,null,null,null,null,null,null,null,null,null,null,{"$f":"J607+O607","v":0}]
[null,null,null,null,null,null,null,null,null,null,null,null,null,null,null,{"$f":"J608+O608","v":0}]
[null,null,null,null,null,null,null,null,null,null,null,null,null,null,null,{"$f":"J609+O609","v":0}]
[null,null,null,null,null,null,null,null,null,null,null,null,null,null,null,{"$f":"J610+O610","v":0}]
[null,null,null,null,null,null,null,null,null,null,null,null,null,null,null,{"$f":"J611+O611","v":0}]
[null,null,null,null,null,null,null,null,null,null,null,null,null,null,null,{"$f":"J612+O612","v":0}]
[null,null,null,null,null,null,null,null,null,null,null,null,null,null,null,{"$f":"J613+O613","v":0}]
[null,null,null,null,null,null,null,null,null,null,null,null,null,null,null,{"$f":"J614+O614","v":0}]
[null,null,null,null,null,null,null,null,null,null,null,null,null,null,null,{"$f":"J615+O615","v":0}]
[null,null,null,null,null,null,null,null,null,null,null,null,null,null,null,{"$f":"J616+O616","v":0}]
[null,null,null,null,null,null,null,null,null,null,null,null,null,null,null,{"$f":"J617+O617","v":0}]
[null,null,null,null,null,null,null,null,null,null,null,null,null,null,null,{"$f":"J618+O618","v":0}]
[null,null,null,null,null,null,null,null,null,null,null,null,null,null,null,{"$f":"J619+O619","v":0}]
[null,null,null,null,null,null,null,null,null,null,null,null,null,null,null,{"$f":"J620+O620","v":0}]
[null,null,null,null,null,null,null,null,null,null,null,null,null,null,null,{"$f":"J621+O621","v":0}]
[null,null,null,null,null,null,null,null,null,null,null,null,null,null,null,{"$f":"J622+O622","v":0}]
[null,null,null,null,null,null,null,null,null,null,null,null,null,null,null,{"$f":"J623+O623","v":0}]
[null,null,null,null,null,null,null,null,null,null,null,null,null,null,null,{"$f":"J624+O624","v":0}]
[null,null,null,null,null,null,null,null,null,null,null,null,null,null,null,{"$f":"J625+O625","v":0}]
[null,null,null,null,null,null,null,null,null,null,null,null,null,null,null,{"$f":"J626+O626","v":0}]
[null,null,null,null,null,null,null,null,null,null,null,null,null,null,null,{"$f":"J627+O627","v":0}]
[null,null,null,null,null,null,null,null,null,null,null,null,null,null,null,{"$f":"J628+O628","v":0}]
[null,null,null,null,null,null,null,null,null,null,null,null,null,null,null,{"$f":"J629+O629","v":0}]
[null,null,null,null,null,null,null,null,null,null,null,null,null,null,null,{"$f":"J630+O630","v":0}]
[null,null,null,null,null,null,null,null,null,null,null,null,null,null,null,{"$f":"J631+O631","v":0}]
[null,null,null,null,null,null,null,null,null,null,null,null,null,null,null,{"$f":"J632+O632","v":0}]
[null,null,null,null,null,null,null,null,null,null,null,null,null,null,null,{"$f":"J633+O633","v":0}]
[null,null,null,null,null,null,null,null,null,null,null,null,null,null,null,{"$f":"J634+O634","v":0}]
[null,null,null,null,null,null,null,null,null,null,null,null,null,null,null,{"$f":"J635+O635","v":0}]
[null,null,null,null,null,null,null,null,null,null,null,null,null,null,null,{"$f":"J636+O636","v":0}]
[null,null,null,null,null,null,null,null,null,null,null,null,null,null,null,{"$f":"J637+O637","v":0}]
[null,null,null,null,null,null,null,null,null,null,null,null,null,null,null,{"$f":"J638+O638","v":0}]
[null,null,null,null,null,null,null,null,null,null,null,null,null,null,null,{"$f":"J639+O639","v":0}]
[null,null,null,null,null,null,null,null,null,null,null,null,null,null,null,{"$f":"J640+O640","v":0}]
[null,null,null,null,null,null,null,null,null,null,null,null,null,null,null,{"$f":"J641+O641","v":0}]
[null,null,null,null,null,null,null,null,null,null,null,null,null,null,null,{"$f":"J642+O642","v":0}]
[null,null,null,null,null,null,null,null,null,null,null,null,null,null,null,{"$f":"J643+O643","v":0}]
[null,null,null,null,null,null,null,null,null,null,null,null,null,null,null,{"$f":"J644+O644","v":0}]
[null,null,null,null,null,null,null,null,null,null,null,null,null,null,null,{"$f":"J645+O645","v":0}]
[null,null,null,null,null,null,null,null,null,null,null,null,null,null,null,{"$f":"J646+O646","v":0}]
[null,null,null,null,null,null,null,null,null,null,null,null,null,null,null,{"$f":"J647+O647","v":0}]
[null,null,null,null,null,null,null,null,null,null,null,null,null,null,null,{"$f":"J648+O648","v":0}]
[null,null,null,null,null,null,null,null,null,null,null,null,null,null,null,{"$f":"J649+O649","v":0}]
[null,null,null,null,null,null,null,null,null,null,null,null,null,null,null,{"$f":"J650+O650","v":0}]
[null,null,null,null,null,null,null,null,null,null,null,null,null,null,null,{"$f":"J651+O651","v":0}]
[null,null,null,null,null,null,null,null,null,null,null,null,null,null,null,{"$f":"J652+O652","v":0}]
[null,null,null,null,null,null,null,null,null,null,null,null,null,null,null,{"$f":"J653+O653","v":0}]
[null,null,null,null,null,null,null,null,null,null,null,null,null,null,null,{"$f":"J654+O654","v":0}]
[null,null,null,null,null,null,null,null,null,null,null,null,null,null,null,{"$f":"J655+O655","v":0}]
[null,null,null,null,null,null,null,null,null,null,null,null,null,null,null,{"$f":"J656+O656","v":0}]
[null,null,null,null,null,null,null,null,null,null,null,null,null,null,null,{"$f":"J657+O657","v":0}]
[null,null,null,null,null,null,null,null,null,null,null,null,null,null,null,{"$f":"J658+O658","v":0}]
[null,null,null,null,null,null,null,null,null,null,null,null,null,null,null,{"$f":"J659+O659","v":0}]
[null,null,null,null,null,null,null,null,null,null,null,null,null,null,null,{"$f":"J660+O660","v":0}]
[null,null,null,null,null,null,null,null,null,null,null,null,null,null,null,{"$f":"J661+O661","v":0}]
[null,null,null,null,null,null,null,null,null,null,null,null,null,null,null,{"$f":"J662+O662","v":0}]
[null,null,null,null,null,null,null,null,null,null,null,null,null,null,null,{"$f":"J663+O663","v":0}]
[null,null,null,null,null,null,null,null,null,null,null,null,null,null,null,{"$f":"J664+O664","v":0}]
[null,null,null,null,null,null,null,null,null,null,null,null,null,null,null,{"$f":"J665+O665","v":0}]
[null,null,null,null,null,null,null,null,null,null,null,null,null,null,null,{"$f":"J666+O666","v":0}]
[null,null,null,null,null,null,null,null,null,null,null,null,null,null,null,{"$f":"J667+O667","v":0}]
[null,null,null,null,null,null,null,null,null,null,null,null,null,null,null,{"$f":"J668+O668","v":0}]
[null,null,null,null,null,null,null,null,null,null,null,null,null,null,null,{"$f":"J669+O669","v":0}]
[null,null,null,null,null,null,null,null,null,null,null,null,null,null,null,{"$f":"J670+O670","v":0}]
[null,null,null,null,null,null,null,null,null,null,null,null,null,null,null,{"$f":"J671+O671","v":0}]
[null,null,null,null,null,null,null,null,null,null,null,null,null,null,null,{"$f":"J672+O672","v":0}]
[null,null,null,null,null,null,null,null,null,null,null,null,null,null,null,{"$f":"J673+O673","v":0}]
[null,null,null,null,null,null,null,null,null,null,null,null,null,null,null,{"$f":"J674+O674","v":0}]
[null,null,null,null,null,null,null,null,null,null,null,null,null,null,null,{"$f":"J675+O675","v":0}]
[null,null,null,null,null,null,null,null,null,null,null,null,null,null,null,{"$f":"J676+O676","v":0}]
[null,null,null,null,null,null,null,null,null,null,null,null,null,null,null,{"$f":"J677+O677","v":0}]
[null,null,null,null,null,null,null,null,null,null,null,null,null,null,null,{"$f":"J678+O678","v":0}]
[null,null,null,null,null,null,null,null,null,null,null,null,null,null,null,{"$f":"J679+O679","v":0}]
[null,null,null,null,null,null,null,null,null,null,null,null,null,null,null,{"$f":"J680+O680","v":0}]
[null,null,null,null,null,null,null,null,null,null,null,null,null,null,null,{"$f":"J681+O681","v":0}]
[null,null,null,null,null,null,null,null,null,null,null,null,null,null,null,{"$f":"J682+O682","v":0}]
[null,null,null,null,null,null,null,null,null,null,null,null,null,null,null,{"$f":"J683+O683","v":0}]
[null,null,null,null,null,null,null,null,null,null,null,null,null,null,null,{"$f":"J684+O684","v":0}]
[null,null,null,null,null,null,null,null,null,null,null,null,null,null,null,{"$f":"J685+O685","v":0}]
[null,null,null,null,null,null,null,null,null,null,null,null,null,null,null,{"$f":"J686+O686","v":0}]
[null,null,null,null,null,null,null,null,null,null,null,null,null,null,null,{"$f":"J687+O687","v":0}]
[null,null,null,null,null,null,null,null,null,null,null,null,null,null,null,{"$f":"J688+O688","v":0}]
[null,null,null,null,null,null,null,null,null,null,null,null,null,null,null,{"$f":"J689+O689","v":0}]
[null,null,null,null,null,null,null,null,null,null,null,null,null,null,null,{"$f":"J690+O690","v":0}]
[null,null,null,null,null,null,null,null,null,null,null,null,null,null,null,{"$f":"J691+O691","v":0}]
[null,null,null,null,null,null,null,null,null,null,null,null,null,null,null,{"$f":"J692+O692","v":0}]
[null,null,null,null,null,null,null,null,null,null,null,null,null,null,null,{"$f":"J693+O693","v":0}]
[null,null,null,null,null,null,null,null,null,null,null,null,null,null,null,{"$f":"J694+O694","v":0}]
[null,null,null,null,null,null,null,null,null,null,null,null,null,null,null,{"$f":"J695+O695","v":0}]
[null,null,null,null,null,null,null,null,null,null,null,null,null,null,null,{"$f":"J696+O696","v":0}]
[null,null,null,null,null,null,null,null,null,null,null,null,null,null,null,{"$f":"J697+O697","v":0}]
[null,null,null,null,null,null,null,null,null,null,null,null,null,null,null,{"$f":"J698+O698","v":0}]
[null,null,null,null,null,null,null,null,null,null,null,null,null,null,null,{"$f":"J699+O699","v":0}]
[null,null,null,null,null,null,null,null,null,null,null,null,null,null,null,{"$f":"J700+O700","v":0}]
[null,null,null,null,null,null,null,null,null,null,null,null,null,null,null,{"$f":"J701+O701","v":0}]
[null,null,null,null,null,null,null,null,null,null,null,null,null,null,null,{"$f":"J702+O702","v":0}]
[null,null,null,null,null,null,null,null,null,null,null,null,null,null,null,{"$f":"J703+O703","v":0}]
[null,null,null,null,null,null,null,null,null,null,null,null,null,null,null,{"$f":"J704+O704","v":0}]
[null,null,null,null,null,null,null,null,null,null,null,null,null,null,null,{"$f":"J705+O705","v":0}]
[null,null,null,null,null,null,null,null,null,null,null,null,null,null,null,{"$f":"J706+O706","v":0}]
[null,null,null,null,null,null,null,null,null,null,null,null,null,null,null,{"$f":"J707+O707","v":0}]
[null,null,null,null,null,null,null,null,null,null,null,null,null,null,null,{"$f":"J708+O708","v":0}]
[null,null,null,null,null,null,null,null,null,null,null,null,null,null,null,{"$f":"J709+O709","v":0}]
[null,null,null,null,null,null,null,null,null,null,null,null,null,null,null,{"$f":"J710+O710","v":0}]
[null,null,null,null,null,null,null,null,null,null,null,null,null,null,null,{"$f":"J711+O711","v":0}]
[null,null,null,null,null,null,null,null,null,null,null,null,null,null,null,{"$f":"J712+O712","v":0}]
[null,null,null,null,null,null,null,null,null,null,null,null,null,null,null,{"$f":"J713+O713","v":0}]
[null,null,null,null,null,null,null,null,null,null,null,null,null,null,null,{"$f":"J714+O714","v":0}]
[null,null,null,null,null,null,null,null,null,null,null,null,null,null,null,{"$f":"J715+O715","v":0}]
[null,null,null,null,null,null,null,null,null,null,null,null,null,null,null,{"$f":"J716+O716","v":0}]
[null,null,null,null,null,null,null,null,null,null,null,null,null,null,null,{"$f":"J717+O717","v":0}]
[null,null,null,null,null,null,null,null,null,null,null,null,null,null,null,{"$f":"J718+O718","v":0}]
[null,null,null,null,null,null,null,null,null,null,null,null,null,null,null,{"$f":"J719+O719","v":0}]
[null,null,null,null,null,null,null,null,null,null,null,null,null,null,null,{"$f":"J720+O720","v":0}]
[null,null,null,null,null,null,null,null,null,null,null,null,null,null,null,{"$f":"J721+O721","v":0}]
[null,null,null,null,null,null,null,null,null,null,null,null,null,null,null,{"$f":"J722+O722","v":0}]
[null,null,null,null,null,null,null,null,null,null,null,null,null,null,null,{"$f":"J723+O723","v":0}]
[null,null,null,null,null,null,null,null,null,null,null,null,null,null,null,{"$f":"J724+O724","v":0}]
[null,null,null,null,null,null,null,null,null,null,null,null,null,null,null,{"$f":"J725+O725","v":0}]
[null,null,null,null,null,null,null,null,null,null,null,null,null,null,null,{"$f":"J726+O726","v":0}]
[null,null,null,null,null,null,null,null,null,null,null,null,null,null,null,{"$f":"J727+O727","v":0}]
[null,null,null,null,null,null,null,null,null,null,null,null,null,null,null,{"$f":"J728+O728","v":0}]
[null,null,null,null,null,null,null,null,null,null,null,null,null,null,null,{"$f":"J729+O729","v":0}]
[null,null,null,null,null,null,null,null,null,null,null,null,null,null,null,{"$f":"J730+O730","v":0}]
[null,null,null,null,null,null,null,null,null,null,null,null,null,null,null,{"$f":"J731+O731","v":0}]
[null,null,null,null,null,null,null,null,null,null,null,null,null,null,null,{"$f":"J732+O732","v":0}]
[null,null,null,null,null,null,null,null,null,null,null,null,null,null,null,{"$f":"J733+O733","v":0}]
[null,null,null,null,null,null,null,null,null,null,null,null,null,null,null,{"$f":"J734+O734","v":0}]
[null,null,null,null,null,null,null,null,null,null,null,null,null,null,null,{"$f":"J735+O735","v":0}]
[null,null,null,null,null,null,null,null,null,null,null,null,null,null,null,{"$f":"J736+O736","v":0}]
[null,null,null,null,null,null,null,null,null,null,null,null,null,null,null,{"$f":"J737+O737","v":0}]
[null,null,null,null,null,null,null,null,null,null,null,null,null,null,null,{"$f":"J738+O738","v":0}]
[null,null,null,null,null,null,null,null,null,null,null,null,null,null,null,{"$f":"J739+O739","v":0}]
[null,null,null,null,null,null,null,null,null,null,null,null,null,null,null,{"$f":"J740+O740","v":0}]
[null,null,null,null,null,null,null,null,null,null,null,null,null,null,null,{"$f":"J741+O741","v":0}]
[null,null,null,null,null,null,null,null,null,null,null,null,null,null,null,{"$f":"J742+O742","v":0}]
[null,null,null,null,null,null,null,null,null,null,null,null,null,null,null,{"$f":"J743+O743","v":0}]
[null,null,null,null,null,null,null,null,null,null,null,null,null,null,null,{"$f":"J744+O744","v":0}]
[null,null,null,null,null,null,null,null,null,null,null,null,null,null,null,{"$f":"J745+O745","v":0}]
[null,null,null,null,null,null,null,null,null,null,null,null,null,null,null,{"$f":"J746+O746","v":0}]
[null,null,null,null,null,null,null,null,null,null,null,null,null,null,null,{"$f":"J747+O747","v":0}]
[null,null,null,null,null,null,null,null,null,null,null,null,null,null,null,{"$f":"J748+O748","v":0}]
[null,null,null,null,null,null,null,null,null,null,null,null,null,null,null,{"$f":"J749+O749","v":0}]
[null,null,null,null,null,null,null,null,null,null,null,null,null,null,null,{"$f":"J750+O750","v":0}]
[null,null,null,null,null,null,null,null,null,null,null,null,null,null,null,{"$f":"J751+O751","v":0}]
[null,null,null,null,null,null,null,null,null,null,null,null,null,null,null,{"$f":"J752+O752","v":0}]
[null,null,null,null,null,null,null,null,null,null,null,null,null,null,null,{"$f":"J753+O753","v":0}]
[null,null,null,null,null,null,null,null,null,null,null,null,null,null,null,{"$f":"J754+O754","v":0}]
[null,null,null,null,null,null,null,null,null,null,null,null,null,null,null,{"$f":"J755+O755","v":0}]
[null,null,null,null,null,null,null,null,null,null,null,null,null,null,null,{"$f":"J756+O756","v":0}]
[null,null,null,null,null,null,null,null,null,null,null,null,null,null,null,{"$f":"J757+O757","v":0}]
[null,null,null,null,null,null,null,null,null,null,null,null,null,null,null,{"$f":"J758+O758","v":0}]
[null,null,null,null,null,null,null,null,null,null,null,null,null,null,null,{"$f":"J759+O759","v":0}]
[null,null,null,null,null,null,null,null,null,null,null,null,null,null,null,{"$f":"J760+O760","v":0}]
[null,null,null,null,null,null,null,null,null,null,null,null,null,null,null,{"$f":"J761+O761","v":0}]
[null,null,null,null,null,null,null,null,null,null,null,null,null,null,null,{"$f":"J762+O762","v":0}]
[null,null,null,null,null,null,null,null,null,null,null,null,null,null,null,{"$f":"J763+O763","v":0}]
[null,null,null,null,null,null,null,null,null,null,null,null,null,null,null,{"$f":"J764+O764","v":0}]
[null,null,null,null,null,null,null,null,null,null,null,null,null,null,null,{"$f":"J765+O765","v":0}]
[null,null,null,null,null,null,null,null,null,null,null,null,null,null,null,{"$f":"J766+O766","v":0}]
[null,null,null,null,null,null,null,null,null,null,null,null,null,null,null,{"$f":"J767+O767","v":0}]
[null,null,null,null,null,null,null,null,null,null,null,null,null,null,null,{"$f":"J768+O768","v":0}]
[null,null,null,null,null,null,null,null,null,null,null,null,null,null,null,{"$f":"J769+O769","v":0}]
[null,null,null,null,null,null,null,null,null,null,null,null,null,null,null,{"$f":"J770+O770","v":0}]
[null,null,null,null,null,null,null,null,null,null,null,null,null,null,null,{"$f":"J771+O771","v":0}]
[null,null,null,null,null,null,null,null,null,null,null,null,null,null,null,{"$f":"J772+O772","v":0}]
[null,null,null,null,null,null,null,null,null,null,null,null,null,null,null,{"$f":"J773+O773","v":0}]
[null,null,null,null,null,null,null,null,null,null,null,null,null,null,null,{"$f":"J774+O774","v":0}]
[null,null,null,null,null,null,null,null,null,null,null,null,null,null,null,{"$f":"J775+O775","v":0}]
[null,null,null,null,null,null,null,null,null,null,null,null,null,null,null,{"$f":"J776+O776","v":0}]
[null,null,null,null,null,null,null,null,null,null,null,null,null,null,null,{"$f":"J777+O777","v":0}]
[null,null,null,null,null,null,null,null,null,null,null,null,null,null,null,{"$f":"J778+O778","v":0}]
[null,null,null,null,null,null,null,null,null,null,null,null,null,null,null,{"$f":"J779+O779","v":0}]
[null,null,null,null,null,null,null,null,null,null,null,null,null,null,null,{"$f":"J780+O780","v":0}]
[null,null,null,null,null,null,null,null,null,null,null,null,null,null,null,{"$f":"J781+O781","v":0}]
[null,null,null,null,null,null,null,null,null,null,null,null,null,null,null,{"$f":"J782+O782","v":0}]
[null,null,null,null,null,null,null,null,null,null,null,null,null,null,null,{"$f":"J783+O783","v":0}]
[null,null,null,null,null,null,null,null,null,null,null,null,null,null,null,{"$f":"J784+O784","v":0}]
[null,null,null,null,null,null,null,null,null,null,null,null,null,null,null,{"$f":"J785+O785","v":0}]
[null,null,null,null,null,null,null,null,null,null,null,null,null,null,null,{"$f":"J786+O786","v":0}]
[null,null,null,null,null,null,null,null,null,null,null,null,null,null,null,{"$f":"J787+O787","v":0}]
[null,null,null,null,null,null,null,null,null,null,null,null,null,null,null,{"$f":"J788+O788","v":0}]
[null,null,null,null,null,null,null,null,null,null,null,null,null,null,null,{"$f":"J789+O789","v":0}]
[null,null,null,null,null,null,null,null,null,null,null,null,null,null,null,{"$f":"J790+O790","v":0}]
[null,null,null,null,null,null,null,null,null,null,null,null,null,null,null,{"$f":"J791+O791","v":0}]
[null,null,null,null,null,null,null,null,null,null,null,null,null,null,null,{"$f":"J792+O792","v":0}]
[null,null,null,null,null,null,null,null,null,null,null,null,null,null,null,{"$f":"J793+O793","v":0}]
[null,null,null,null,null,null,null,null,null,null,null,null,null,null,null,{"$f":"J794+O794","v":0}]
[null,null,null,null,null,null,null,null,null,null,null,null,null,null,null,{"$f":"J795+O795","v":0}]
[null,null,null,null,null,null,null,null,null,null,null,null,null,null,null,{"$f":"J796+O796","v":0}]
[null,null,null,null,null,null,null,null,null,null,null,null,null,null,null,{"$f":"J797+O797","v":0}]
[null,null,null,null,null,null,null,null,null,null,null,null,null,null,null,{"$f":"J798+O798","v":0}]
[null,null,null,null,null,null,null,null,null,null,null,null,null,null,null,{"$f":"J799+O799","v":0}]
[null,null,null,null,null,null,null,null,null,null,null,null,null,null,null,{"$f":"J800+O800","v":0}]
[null,null,null,null,null,null,null,null,null,null,null,null,null,null,null,{"$f":"J801+O801","v":0}]
[null,null,null,null,null,null,null,null,null,null,null,null,null,null,null,{"$f":"J802+O802","v":0}]
[null,null,null,null,null,null,null,null,null,null,null,null,null,null,null,{"$f":"J803+O803","v":0}]
[null,null,null,null,null,null,null,null,null,null,null,null,null,null,null,{"$f":"J804+O804","v":0}]
[null,null,null,null,null,null,null,null,null,null,null,null,null,null,null,{"$f":"J805+O805","v":0}]
[null,null,null,null,null,null,null,null,null,null,null,null,null,null,null,{"$f":"J806+O806","v":0}]
[null,null,null,null,null,null,null,null,null,null,null,null,null,null,null,{"$f":"J807+O807","v":0}]
[null,null,null,null,null,null,null,null,null,null,null,null,null,null,null,{"$f":"J808+O808","v":0}]
[null,null,null,null,null,null,null,null,null,null,null,null,null,null,null,{"$f":"J809+O809","v":0}]
[null,null,null,null,null,null,null,null,null,null,null,null,null,null,null,{"$f":"J810+O810","v":0}]
[null,null,null,null,null,null,null,null,null,null,null,null,null,null,null,{"$f":"J811+O811","v":0}]
[null,null,null,null,null,null,null,null,null,null,null,null,null,null,null,{"$f":"J812+O812","v":0}]
[null,null,null,null,null,null,null,null,null,null,null,null,null,null,null,{"$f":"J813+O813","v":0}]
[null,null,null,null,null,null,null,null,null,null,null,null,null,null,null,{"$f":"J814+O814","v":0}]
[null,null,null,null,null,null,null,null,null,null,null,null,null,null,null,{"$f":"J815+O815","v":0}]
[null,null,null,null,null,null,null,null,null,null,null,null,null,null,null,{"$f":"J816+O816","v":0}]
[null,null,null,null,null,null,null,null,null,null,null,null,null,null,null,{"$f":"J817+O817","v":0}]
[null,null,null,null,null,null,null,null,null,null,null,null,null,null,null,{"$f":"J818+O818","v":0}]
[null,null,null,null,null,null,null,null,null,null,null,null,null,null,null,{"$f":"J819+O819","v":0}]
[null,null,null,null,null,null,null,null,null,null,null,null,null,null,null,{"$f":"J820+O820","v":0}]
[null,null,null,null,null,null,null,null,null,null,null,null,null,null,null,{"$f":"J821+O821","v":0}]
[null,null,null,null,null,null,null,null,null,null,null,null,null,null,null,{"$f":"J822+O822","v":0}]
[null,null,null,null,null,null,null,null,null,null,null,null,null,null,null,{"$f":"J823+O823","v":0}]
[null,null,null,null,null,null,null,null,null,null,null,null,null,null,null,{"$f":"J824+O824","v":0}]
[null,null,null,null,null,null,null,null,null,null,null,null,null,null,null,{"$f":"J825+O825","v":0}]
[null,null,null,null,null,null,null,null,null,null,null,null,null,null,null,{"$f":"J826+O826","v":0}]
[null,null,null,null,null,null,null,null,null,null,null,null,null,null,null,{"$f":"J827+O827","v":0}]
[null,null,null,null,null,null,null,null,null,null,null,null,null,null,null,{"$f":"J828+O828","v":0}]
[null,null,null,null,null,null,null,null,null,null,null,null,null,null,null,{"$f":"J829+O829","v":0}]
[null,null,null,null,null,null,null,null,null,null,null,null,null,null,null,{"$f":"J830+O830","v":0}]
[null,null,null,null,null,null,null,null,null,null,null,null,null,null,null,{"$f":"J831+O831","v":0}]
[null,null,null,null,null,null,null,null,null,null,null,null,null,null,null,{"$f":"J832+O832","v":0}]
[null,null,null,null,null,null,null,null,null,null,null,null,null,null,null,{"$f":"J833+O833","v":0}]
[null,null,null,null,null,null,null,null,null,null,null,null,null,null,null,{"$f":"J834+O834","v":0}]
[null,null,null,null,null,null,null,null,null,null,null,null,null,null,null,{"$f":"J835+O835","v":0}]
[null,null,null,null,null,null,null,null,null,null,null,null,null,null,null,{"$f":"J836+O836","v":0}]
[null,null,null,null,null,null,null,null,null,null,null,null,null,null,null,{"$f":"J837+O837","v":0}]
[null,null,null,null,null,null,null,null,null,null,null,null,null,null,null,{"$f":"J838+O838","v":0}]
[null,null,null,null,null,null,null,null,null,null,null,null,null,null,null,{"$f":"J839+O839","v":0}]
[null,null,null,null,null,null,null,null,null,null,null,null,null,null,null,{"$f":"J840+O840","v":0}]
[null,null,null,null,null,null,null,null,null,null,null,null,null,null,null,{"$f":"J841+O841","v":0}]
[null,null,null,null,null,null,null,null,null,null,null,null,null,null,null,{"$f":"J842+O842","v":0}]
[null,null,null,null,null,null,null,null,null,null,null,null,null,null,null,{"$f":"J843+O843","v":0}]
[null,null,null,null,null,null,null,null,null,null,null,null,null,null,null,{"$f":"J844+O844","v":0}]
[null,null,null,null,null,null,null,null,null,null,null,null,null,null,null,{"$f":"J845+O845","v":0}]
[null,null,null,null,null,null,null,null,null,null,null,null,null,null,null,{"$f":"J846+O846","v":0}]
[null,null,null,null,null,null,null,null,null,null,null,null,null,null,null,{"$f":"J847+O847","v":0}]
[null,null,null,null,null,null,null,null,null,null,null,null,null,null,null,{"$f":"J848+O848","v":0}]
[null,null,null,null,null,null,null,null,null,null,null,null,null,null,null,{"$f":"J849+O849","v":0}]
[null,null,null,null,null,null,null,null,null,null,null,null,null,null,null,{"$f":"J850+O850","v":0}]
[null,null,null,null,null,null,null,null,null,null,null,null,null,null,null,{"$f":"J851+O851","v":0}]
[null,null,null,null,null,null,null,null,null,null,null,null,null,null,null,{"$f":"J852+O852","v":0}]
[null,null,null,null,null,null,null,null,null,null,null,null,null,null,null,{"$f":"J853+O853","v":0}]
[null,null,null,null,null,null,null,null,null,null,null,null,null,null,null,{"$f":"J854+O854","v":0}]
[null,null,null,null,null,null,null,null,null,null,null,null,null,null,null,{"$f":"J855+O855","v":0}]
[null,null,null,null,null,null,null,null,null,null,null,null,null,null,null,{"$f":"J856+O856","v":0}]
[null,null,null,null,null,null,null,null,null,null,null,null,null,null,null,{"$f":"J857+O857","v":0}]
[null,null,null,null,null,null,null,null,null,null,null,null,null,null,null,{"$f":"J858+O858","v":0}]
[null,null,null,null,null,null,null,null,null,null,null,null,null,null,null,{"$f":"J859+O859","v":0}]
[null,null,null,null,null,null,null,null,null,null,null,null,null,null,null,{"$f":"J860+O860","v":0}]
[null,null,null,null,null,null,null,null,null,null,null,null,null,null,null,{"$f":"J861+O861","v":0}]
[null,null,null,null,null,null,null,null,null,null,null,null,null,null,null,{"$f":"J862+O862","v":0}]
[null,null,null,null,null,null,null,null,null,null,null,null,null,null,null,{"$f":"J863+O863","v":0}]
[null,null,null,null,null,null,null,null,null,null,null,null,null,null,null,{"$f":"J864+O864","v":0}]
[null,null,null,null,null,null,null,null,null,null,null,null,null,null,null,{"$f":"J865+O865","v":0}]
[null,null,null,null,null,null,null,null,null,null,null,null,null,null,null,{"$f":"J866+O866","v":0}]
[null,null,null,null,null,null,null,null,null,null,null,null,null,null,null,{"$f":"J867+O867","v":0}]
[null,null,null,null,null,null,null,null,null,null,null,null,null,null,null,{"$f":"J868+O868","v":0}]
[null,null,null,null,null,null,null,null,null,null,null,null,null,null,null,{"$f":"J869+O869","v":0}]
[null,null,null,null,null,null,null,null,null,null,null,null,null,null,null,{"$f":"J870+O870","v":0}]
[null,null,null,null,null,null,null,null,null,null,null,null,null,null,null,{"$f":"J871+O871","v":0}]
[null,null,null,null,null,null,null,null,null,null,null,null,null,null,null,{"$f":"J872+O872","v":0}]
[null,null,null,null,null,null,null,null,null,null,null,null,null,null,null,{"$f":"J873+O873","v":0}]
[null,null,null,null,null,null,null,null,null,null,null,null,null,null,null,{"$f":"J874+O874","v":0}]
[null,null,null,null,null,null,null,null,null,null,null,null,null,null,null,{"$f":"J875+O875","v":0}]
[null,null,null,null,null,null,null,null,null,null,null,null,null,null,null,{"$f":"J876+O876","v":0}]
[null,null,null,null,null,null,null,null,null,null,null,null,null,null,null,{"$f":"J877+O877","v":0}]
[null,null,null,null,null,null,null,null,null,null,null,null,null,null,null,{"$f":"J878+O878","v":0}]
[null,null,null,null,null,null,null,null,null,null,null,null,null,null,null,{"$f":"J879+O879","v":0}]
[null,null,null,null,null,null,null,null,null,null,null,null,null,null,null,{"$f":"J880+O880","v":0}]
[null,null,null,null,null,null,null,null,null,null,null,null,null,null,null,{"$f":"J881+O881","v":0}]
[null,null,null,null,null,null,null,null,null,null,null,null,null,null,null,{"$f":"J882+O882","v":0}]
[null,null,null,null,null,null,null,null,null,null,null,null,null,null,null,{"$f":"J883+O883","v":0}]
[null,null,null,null,null,null,null,null,null,null,null,null,null,null,null,{"$f":"J884+O884","v":0}]
[null,null,null,null,null,null,null,null,null,null,null,null,null,null,null,{"$f":"J885+O885","v":0}]
[null,null,null,null,null,null,null,null,null,null,null,null,null,null,null,{"$f":"J886+O886","v":0}]
[null,null,null,null,null,null,null,null,null,null,null,null,null,null,null,{"$f":"J887+O887","v":0}]
[null,null,null,null,null,null,null,null,null,null,null,null,null,null,null,{"$f":"J888+O888","v":0}]
[null,null,null,null,null,null,null,null,null,null,null,null,null,null,null,{"$f":"J889+O889","v":0}]
[null,null,null,null,null,null,null,null,null,null,null,null,null,null,null,{"$f":"J890+O890","v":0}]
[null,null,null,null,null,null,null,null,null,null,null,null,null,null,null,{"$f":"J891+O891","v":0}]
[null,null,null,null,null,null,null,null,null,null,null,null,null,null,null,{"$f":"J892+O892","v":0}]
[null,null,null,null,null,null,null,null,null,null,null,null,null,null,null,{"$f":"J893+O893","v":0}]
[null,null,null,null,null,null,null,null,null,null,null,null,null,null,null,{"$f":"J894+O894","v":0}]
[null,null,null,null,null,null,null,null,null,null,null,null,null,null,null,{"$f":"J895+O895","v":0}]
[null,null,null,null,null,null,null,null,null,null,null,null,null,null,null,{"$f":"J896+O896","v":0}]
[null,null,null,null,null,null,null,null,null,null,null,null,null,null,null,{"$f":"J897+O897","v":0}]
[null,null,null,null,null,null,null,null,null,null,null,null,null,null,null,{"$f":"J898+O898","v":0}]
[null,null,null,null,null,null,null,null,null,null,null,null,null,null,null,{"$f":"J899+O899","v":0}]
[null,null,null,null,null,null,null,null,null,null,null,null,null,null,null,{"$f":"J900+O900","v":0}]
[null,null,null,null,null,null,null,null,null,null,null,null,null,null,null,{"$f":"J901+O901","v":0}]
[null,null,null,null,null,null,null,null,null,null,null,null,null,null,null,{"$f":"J902+O902","v":0}]
[null,null,null,null,null,null,null,null,null,null,null,null,null,null,null,{"$f":"J903+O903","v":0}]
[null,null,null,null,null,null,null,null,null,null,null,null,null,null,null,{"$f":"J904+O904","v":0}]
[null,null,null,null,null,null,null,null,null,null,null,null,null,null,null,{"$f":"J905+O905","v":0}]
[null,null,null,null,null,null,null,null,null,null,null,null,null,null,null,{"$f":"J906+O906","v":0}]
[null,null,null,null,null,null,null,null,null,null,null,null,null,null,null,{"$f":"J907+O907","v":0}]
[null,null,null,null,null,null,null,null,null,null,null,null,null,null,null,{"$f":"J908+O908","v":0}]
[null,null,null,null,null,null,null,null,null,null,null,null,null,null,null,{"$f":"J909+O909","v":0}]
[null,null,null,null,null,null,null,null,null,null,null,null,null,null,null,{"$f":"J910+O910","v":0}]
[null,null,null,null,null,null,null,null,null,null,null,null,null,null,null,{"$f":"J911+O911","v":0}]
[null,null,null,null,null,null,null,null,null,null,null,null,null,null,null,{"$f":"J912+O912","v":0}]
[null,null,null,null,null,null,null,null,null,null,null,null,null,null,null,{"$f":"J913+O913","v":0}]
[null,null,null,null,null,null,null,null,null,null,null,null,null,null,null,{"$f":"J914+O914","v":0}]
[null,null,null,null,null,null,null,null,null,null,null,null,null,null,null,{"$f":"J915+O915","v":0}]
[null,null,null,null,null,null,null,null,null,null,null,null,null,null,null,{"$f":"J916+O916","v":0}]
[null,null,null,null,null,null,null,null,null,null,null,null,null,null,null,{"$f":"J917+O917","v":0}]
[null,null,null,null,null,null,null,null,null,null,null,null,null,null,null,{"$f":"J918+O918","v":0}]
[null,null,null,null,null,null,null,null,null,null,null,null,null,null,null,{"$f":"J919+O919","v":0}]
[null,null,null,null,null,null,null,null,null,null,null,null,null,null,null,{"$f":"J920+O920","v":0}]
[null,null,null,null,null,null,null,null,null,null,null,null,null,null,null,{"$f":"J921+O921","v":0}]
[null,null,null,null,null,null,null,null,null,null,null,null,null,null,null,{"$f":"J922+O922","v":0}]
[null,null,null,null,null,null,null,null,null,null,null,null,null,null,null,{"$f":"J923+O923","v":0}]
[null,null,null,null,null,null,null,null,null,null,null,null,null,null,null,{"$f":"J924+O924","v":0}]
[null,null,null,null,null,null,null,null,null,null,null,null,null,null,null,{"$f":"J925+O925","v":0}]
[null,null,null,null,null,null,null,null,null,null,null,null,null,null,null,{"$f":"J926+O926","v":0}]
[null,null,null,null,null,null,null,null,null,null,null,null,null,null,null,{"$f":"J927+O927","v":0}]
[null,null,null,null,null,null,null,null,null,null,null,null,null,null,null,{"$f":"J928+O928","v":0}]
[null,null,null,null,null,null,null,null,null,null,null,null,null,null,null,{"$f":"J929+O929","v":0}]
[null,null,null,null,null,null,null,null,null,null,null,null,null,null,null,{"$f":"J930+O930","v":0}]
[null,null,null,null,null,null,null,null,null,null,null,null,null,null,null,{"$f":"J931+O931","v":0}]
[null,null,null,null,null,null,null,null,null,null,null,null,null,null,null,{"$f":"J932+O932","v":0}]
[null,null,null,null,null,null,null,null,null,null,null,null,null,null,null,{"$f":"J933+O933","v":0}]
[null,null,null,null,null,null,null,null,null,null,null,null,null,null,null,{"$f":"J934+O934","v":0}]
[null,null,null,null,null,null,null,null,null,null,null,null,null,null,null,{"$f":"J935+O935","v":0}]
[null,null,null,null,null,null,null,null,null,null,null,null,null,null,null,{"$f":"J936+O936","v":0}]
[null,null,null,null,null,null,null,null,null,null,null,null,null,null,null,{"$f":"J937+O937","v":0}]
[null,null,null,null,null,null,null,null,null,null,null,null,null,null,null,{"$f":"J938+O938","v":0}]
[null,null,null,null,null,null,null,null,null,null,null,null,null,null,null,{"$f":"J939+O939","v":0}]
[null,null,null,null,null,null,null,null,null,null,null,null,null,null,null,{"$f":"J940+O940","v":0}]
[null,null,null,null,null,null,null,null,null,null,null,null,null,null,null,{"$f":"J941+O941","v":0}]
[null,null,null,null,null,null,null,null,null,null,null,null,null,null,null,{"$f":"J942+O942","v":0}]
[null,null,null,null,null,null,null,null,null,null,null,null,null,null,null,{"$f":"J943+O943","v":0}]
[null,null,null,null,null,null,null,null,null,null,null,null,null,null,null,{"$f":"J944+O944","v":0}]
[null,null,null,null,null,null,null,null,null,null,null,null,null,null,null,{"$f":"J945+O945","v":0}]
[null,null,null,null,null,null,null,null,null,null,null,null,null,null,null,{"$f":"J946+O946","v":0}]
[null,null,null,null,null,null,null,null,null,null,null,null,null,null,null,{"$f":"J947+O947","v":0}]
[null,null,null,null,null,null,null,null,null,null,null,null,null,null,null,{"$f":"J948+O948","v":0}]
[null,null,null,null,null,null,null,null,null,null,null,null,null,null,null,{"$f":"J949+O949","v":0}]
[null,null,null,null,null,null,null,null,null,null,null,null,null,null,null,{"$f":"J950+O950","v":0}]
[null,null,null,null,null,null,null,null,null,null,null,null,null,null,null,{"$f":"J951+O951","v":0}]
[null,null,null,null,null,null,null,null,null,null,null,null,null,null,null,{"$f":"J952+O952","v":0}]
[null,null,null,null,null,null,null,null,null,null,null,null,null,null,null,{"$f":"J953+O953","v":0}]
[null,null,null,null,null,null,null,null,null,null,null,null,null,null,null,{"$f":"J954+O954","v":0}]
[null,null,null,null,null,null,null,null,null,null,null,null,null,null,null,{"$f":"J955+O955","v":0}]
[null,null,null,null,null,null,null,null,null,null,null,null,null,null,null,{"$f":"J956+O956","v":0}]
[null,null,null,null,null,null,null,null,null,null,null,null,null,null,null,{"$f":"J957+O957","v":0}]
[null,null,null,null,null,null,null,null,null,null,null,null,null,null,null,{"$f":"J958+O958","v":0}]
[null,null,null,null,null,null,null,null,null,null,null,null,null,null,null,{"$f":"J959+O959","v":0}]
[null,null,null,null,null,null,null,null,null,null,null,null,null,null,null,{"$f":"J960+O960","v":0}]
[null,null,null,null,null,null,null,null,null,null,null,null,null,null,null,{"$f":"J961+O961","v":0}]
[null,null,null,null,null,null,null,null,null,null,null,null,null,null,null,{"$f":"J962+O962","v":0}]
[null,null,null,null,null,null,null,null,null,null,null,null,null,null,null,{"$f":"J963+O963","v":0}]
[null,null,null,null,null,null,null,null,null,null,null,null,null,null,null,{"$f":"J964+O964","v":0}]
[null,null,null,null,null,null,null,null,null,null,null,null,null,null,null,{"$f":"J965+O965","v":0}]
[null,null,null,null,null,null,null,null,null,null,null,null,null,null,null,{"$f":"J966+O966","v":0}]
[null,null,null,null,null,null,null,null,null,null,null,null,null,null,null,{"$f":"J967+O967","v":0}]
[null,null,null,null,null,null,null,null,null,null,null,null,null,null,null,{"$f":"J968+O968","v":0}]
[null,null,null,null,null,null,null,null,null,null,null,null,null,null,null,{"$f":"J969+O969","v":0}]
[null,null,null,null,null,null,null,null,null,null,null,null,null,null,null,{"$f":"J970+O970","v":0}]
[null,null,null,null,null,null,null,null,null,null,null,null,null,null,null,{"$f":"J971+O971","v":0}]
[null,null,null,null,null,null,null,null,null,null,null,null,null,null,null,{"$f":"J972+O972","v":0}]
[null,null,null,null,null,null,null,null,null,null,null,null,null,null,null,{"$f":"J973+O973","v":0}]
[null,null,null,null,null,null,null,null,null,null,null,null,null,null,null,{"$f":"J974+O974","v":0}]
[null,null,null,null,null,null,null,null,null,null,null,null,null,null,null,{"$f":"J975+O975","v":0}]
[null,null,null,null,null,null,null,null,null,null,null,null,null,null,null,{"$f":"J976+O976","v":0}]
[null,null,null,null,null,null,null,null,null,null,null,null,null,null,null,{"$f":"J977+O977","v":0}]
[null,null,null,null,null,null,null,null,null,null,null,null,null,null,null,{"$f":"J978+O978","v":0}]
[null,null,null,null,null,null,null,null,null,null,null,null,null,null,null,{"$f":"J979+O979","v":0}]
[null,null,null,null,null,null,null,null,null,null,null,null,null,null,null,{"$f":"J980+O980","v":0}]
[null,null,null,null,null,null,null,null,null,null,null,null,null,null,null,{"$f":"J981+O981","v":0}]
[null,null,null,null,null,null,null,null,null,null,null,null,null,null,null,{"$f":"J982+O982","v":0}]
[null,null,null,null,null,null,null,null,null,null,null,null,null,null,null,{"$f":"J983+O983","v":0}]
[null,null,null,null,null,null,null,null,null,null,null,null,null,null,null,{"$f":"J984+O984","v":0}]
[null,null,null,null,null,null,null,null,null,null,null,null,null,null,null,{"$f":"J985+O985","v":0}]
[null,null,null,null,null,null,null,null,null,null,null,null,null,null,null,{"$f":"J986+O986","v":0}]
[null,null,null,null,null,null,null,null,null,null,null,null,null,null,null,{"$f":"J987+O987","v":0}]
[null,null,null,null,null,null,null,null,null,null,null,null,null,null,null,{"$f":"J988+O988","v":0}]
[null,null,null,null,null,null,null,null,null,null,null,null,null,null,null,{"$f":"J989+O989","v":0}]
[null,null,null,null,null,null,null,null,null,null,null,null,null,null,null,{"$f":"J990+O990","v":0}]
[null,null,null,null,null,null,null,null,null,null,null,null,null,null,null,{"$f":"J991+O991","v":0}]
[null,null,null,null,null,null,null,null,null,null,null,null,null,null,null,{"$f":"J992+O992","v":0}]
[null,null,null,null,null,null,null,null,null,null,null,null,null,null,null,{"$f":"J993+O993","v":0}]
[null,null,null,null,null,null,null,null,null,null,null,null,null,null,null,{"$f":"J994+O994","v":0}]
[null,null,null,null,null,null,null,null,null,null,null,null,null,null,null,{"$f":"J995+O995","v":0}]
[null,null,null,null,null,null,null,null,null,null,null,null,null,null,null,{"$f":"J996+O996","v":0}]
[null,null,null,null,null,null,null,null,null,null,null,null,null,null,null,{"$f":"J997+O997","v":0}]
[null,null,null,null,null,null,null,null,null,null,null,null,null,null,null,{"$f":"J998+O998","v":0}]
[null,null,null,null,null,null,null,null,null,null,null,null,null,null,null,{"$f":"J999+O999","v":0}]
[null,null,null,null,null,null,null,null,null,null,null,null,null,null,null,{"$f":"J1000+O1000","v":0}]
[null,null,null,null,null,null,null,null,null,null,null,null,null,null,null,{"$f":"J1001+O1001","v":0}]
[null,null,null,null,null,null,null,null,null,null,null,null,null,null,null,{"$f":"J1002+O1002","v":0}]
[null,null,null,null,null,null,null,null,null,null,null,null,null,null,null,{"$f":"J1003+O1003","v":0}]
[null,null,null,null,null,null,null,null,null,null,null,null,null,null,null,{"$f":"J1004+O1004","v":0}]
[null,null,null,null,null,null,null,null,null,null,null,null,null,null,null,{"$f":"J1005+O1005","v":0}]
[null,null,null,null,null,null,null,null,null,null,null,null,null,null,null,{"$f":"J1006+O1006","v":0}]
[null,null,null,null,null,null,null,null,null,null,null,null,null,null,null,{"$f":"J1007+O1007","v":0}]
[null,null,null,null,null,null,null,null,null,null,null,null,null,null,null,{"$f":"J1008+O1008","v":0}]
[null,null,null,null,null,null,null,null,null,null,null,null,null,null,null,{"$f":"J1009+O1009","v":0}]
[null,null,null,null,null,null,null,null,null,null,null,null,null,null,null,{"$f":"J1010+O1010","v":0}]
[null,null,null,null,null,null,null,null,null,null,null,null,null,null,null,{"$f":"J1011+O1011","v":0}]
[null,null,null,null,null,null,null,null,null,null,null,null,null,null,null,{"$f":"J1012+O1012","v":0}]
[null,null,null,null,null,null,null,null,null,null,null,null,null,null,null,{"$f":"J1013+O1013","v":0}]
[null,null,null,null,null,null,null,null,null,null,null,null,null,null,null,{"$f":"J1014+O1014","v":0}]
[null,null,null,null,null,null,null,null,null,null,null,null,null,null,null,{"$f":"J1015+O1015","v":0}]
[null,null,null,null,null,null,null,null,null,null,null,null,null,null,null,{"$f":"J1016+O1016","v":0}]
[null,null,null,null,null,null,null,null,null,null,null,null,null,null,null,{"$f":"J1017+O1017","v":0}]
[null,null,null,null,null,null,null,null,null,null,null,null,null,null,null,{"$f":"J1018+O1018","v":0}]
[null,null,null,null,null,null,null,null,null,null,null,null,null,null,null,{"$f":"J1019+O1019","v":0}]
[null,null,null,null,null,null,null,null,null,null,null,null,null,null,null,{"$f":"J1020+O1020","v":0}]
[null,null,null,null,null,null,null,null,null,null,null,null,null,null,null,{"$f":"J1021+O1021","v":0}]
[null,null,null,null,null,null,null,null,null,null,null,null,null,null,null,{"$f":"J1022+O1022","v":0}]
[null,null,null,null,null,null,null,null,null,null,null,null,null,null,null,{"$f":"J1023+O1023","v":0}]
[null,null,null,null,null,null,null,null,null,null,null,null,null,null,null,{"$f":"J1024+O1024","v":0}]
[null,null,null,null,null,null,null,null,null,null,null,null,null,null,null,{"$f":"J1025+O1025","v":0}]
[null,null,null,null,null,null,null,null,null,null,null,null,null,null,null,{"$f":"J1026+O1026","v":0}]
[null,null,null,null,null,null,null,null,null,null,null,null,null,null,null,{"$f":"J1027+O1027","v":0}]
[null,null,null,null,null,null,null,null,null,null,null,null,null,null,null,{"$f":"J1028+O1028","v":0}]
[null,null,null,null,null,null,null,null,null,null,null,null,null,null,null,{"$f":"J1029+O1029","v":0}]
[null,null,null,null,null,null,null,null,null,null,null,null,null,null,null,{"$f":"J1030+O1030","v":0}]
[null,null,null,null,null,null,null,null,null,null,null,null,null,null,null,{"$f":"J1031+O1031","v":0}]
[null,null,null,null,null,null,null,null,null,null,null,null,null,null,null,{"$f":"J1032+O1032","v":0}]
[null,null,null,null,null,null,null,null,null,null,null,null,null,null,null,{"$f":"J1033+O1033","v":0}]
[null,null,null,null,null,null,null,null,null,null,null,null,null,null,null,{"$f":"J1034+O1034","v":0}]
[null,null,null,null,null,null,null,null,null,null,null,null,null,null,null,{"$f":"J1035+O1035","v":0}]
[null,null,null,null,null,null,null,null,null,null,null,null,null,null,null,{"$f":"J1036+O1036","v":0}]
[null,null,null,null,null,null,null,null,null,null,null,null,null,null,null,{"$f":"J1037+O1037","v":0}]
[null,null,null,null,null,null,null,null,null,null,null,null,null,null,null,{"$f":"J1038+O1038","v":0}]
[null,null,null,null,null,null,null,null,null,null,null,null,null,null,null,{"$f":"J1039+O1039","v":0}]
[null,null,null,null,null,null,null,null,null,null,null,null,null,null,null,{"$f":"J1040+O1040","v":0}]
[null,null,null,null,null,null,null,null,null,null,null,null,null,null,null,{"$f":"J1041+O1041","v":0}]
[null,null,null,null,null,null,null,null,null,null,null,null,null,null,null,{"$f":"J1042+O1042","v":0}]
[null,null,null,null,null,null,null,null,null,null,null,null,null,null,null,{"$f":"J1043+O1043","v":0}]
[null,null,null,null,null,null,null,null,null,null,null,null,null,null,null,{"$f":"J1044+O1044","v":0}]
[null,null,null,null,null,null,null,null,null,null,null,null,null,null,null,{"$f":"J1045+O1045","v":0}]
[null,null,null,null,null,null,null,null,null,null,null,null,null,null,null,{"$f":"J1046+O1046","v":0}]
[null,null,null,null,null,null,null,null,null,null,null,null,null,null,null,{"$f":"J1047+O1047","v":0}]
[null,null,null,null,null,null,null,null,null,null,null,null,null,null,null,{"$f":"J1048+O1048","v":0}]
[null,null,null,null,null,null,null,null,null,null,null,null,null,null,null,{"$f":"J1049+O1049","v":0}]
[null,null,null,null,null,null,null,null,null,null,null,null,null,null,null,{"$f":"J1050+O1050","v":0}]
[null,null,null,null,null,null,null,null,null,null,null,null,null,null,null,{"$f":"J1051+O1051","v":0}]
[null,null,null,null,null,null,null,null,null,null,null,null,null,null,null,{"$f":"J1052+O1052","v":0}]
[null,null,null,null,null,null,null,null,null,null,null,null,null,null,null,{"$f":"J1053+O1053","v":0}]
[null,null,null,null,null,null,null,null,null,null,null,null,null,null,null,{"$f":"J1054+O1054","v":0}]
[null,null,null,null,null,null,null,null,null,null,null,null,null,null,null,{"$f":"J1055+O1055","v":0}]
[null,null,null,null,null,null,null,null,null,null,null,null,null,null,null,{"$f":"J1056+O1056","v":0}]
[null,null,null,null,null,null,null,null,null,null,null,null,null,null,null,{"$f":"J1057+O1057","v":0}]
[null,null,null,null,null,null,null,null,null,null,null,null,null,null,null,{"$f":"J1058+O1058","v":0}]
[null,null,null,null,null,null,null,null,null,null,null,null,null,null,null,{"$f":"J1059+O1059","v":0}]
[null,null,null,null,null,null,null,null,null,null,null,null,null,null,null,{"$f":"J1060+O1060","v":0}]
[null,null,null,null,null,null,null,null,null,null,null,null,null,null,null,{"$f":"J1061+O1061","v":0}]
[null,null,null,null,null,null,null,null,null,null,null,null,null,null,null,{"$f":"J1062+O1062","v":0}]
[null,null,null,null,null,null,null,null,null,null,null,null,null,null,null,{"$f":"J1063+O1063","v":0}]
[null,null,null,null,null,null,null,null,null,null,null,null,null,null,null,{"$f":"J1064+O1064","v":0}]
[null,null,null,null,null,null,null,null,null,null,null,null,null,null,null,{"$f":"J1065+O1065","v":0}]
[null,null,null,null,null,null,null,null,null,null,null,null,null,null,null,{"$f":"J1066+O1066","v":0}]
[null,null,null,null,null,null,null,null,null,null,null,null,null,null,null,{"$f":"J1067+O1067","v":0}]
[null,null,null,null,null,null,null,null,null,null,null,null,null,null,null,{"$f":"J1068+O1068","v":0}]
[null,null,null,null,null,null,null,null,null,null,null,null,null,null,null,{"$f":"J1069+O1069","v":0}]
[null,null,null,null,null,null,null,null,null,null,null,null,null,null,null,{"$f":"J1070+O1070","v":0}]
[null,null,null,null,null,null,null,null,null,null,null,null,null,null,null,{"$f":"J1071+O1071","v":0}]
[null,null,null,null,null,null,null,null,null,null,null,null,null,null,null,{"$f":"J1072+O1072","v":0}]
[null,null,null,null,null,null,null,null,null,null,null,null,null,null,null,{"$f":"J1073+O1073","v":0}]
[null,null,null,null,null,null,null,null,null,null,null,null,null,null,null,{"$f":"J1074+O1074","v":0}]
[null,null,null,null,null,null,null,null,null,null,null,null,null,null,null,{"$f":"J1075+O1075","v":0}]
[null,null,null,null,null,null,null,null,null,null,null,null,null,null,null,{"$f":"J1076+O1076","v":0}]
[null,null,null,null,null,null,null,null,null,null,null,null,null,null,null,{"$f":"J1077+O1077","v":0}]
[null,null,null,null,null,null,null,null,null,null,null,null,null,null,null,{"$f":"J1078+O1078","v":0}]
[null,null,null,null,null,null,null,null,null,null,null,null,null,null,null,{"$f":"J1079+O1079","v":0}]
[null,null,null,null,null,null,null,null,null,null,null,null,null,null,null,{"$f":"J1080+O1080","v":0}]
[null,null,null,null,null,null,null,null,null,null,null,null,null,null,null,{"$f":"J1081+O1081","v":0}]
[null,null,null,null,null,null,null,null,null,null,null,null,null,null,null,{"$f":"J1082+O1082","v":0}]
[null,null,null,null,null,null,null,null,null,null,null,null,null,null,null,{"$f":"J1083+O1083","v":0}]
[null,null,null,null,null,null,null,null,null,null,null,null,null,null,null,{"$f":"J1084+O1084","v":0}]
[null,null,null,null,null,null,null,null,null,null,null,null,null,null,null,{"$f":"J1085+O1085","v":0}]
[null,null,null,null,null,null,null,null,null,null,null,null,null,null,null,{"$f":"J1086+O1086","v":0}]
[null,null,null,null,null,null,null,null,null,null,null,null,null,null,null,{"$f":"J1087+O1087","v":0}]
[null,null,null,null,null,null,null,null,null,null,null,null,null,null,null,{"$f":"J1088+O1088","v":0}]
[null,null,null,null,null,null,null,null,null,null,null,null,null,null,null,{"$f":"J1089+O1089","v":0}]
[null,null,null,null,null,null,null,null,null,null,null,null,null,null,null,{"$f":"J1090+O1090","v":0}]
[null,null,null,null,null,null,null,null,null,null,null,null,null,null,null,{"$f":"J1091+O1091","v":0}]
[null,null,null,null,null,null,null,null,null,null,null,null,null,null,null,{"$f":"J1092+O1092","v":0}]
[null,null,null,null,null,null,null,null,null,null,null,null,null,null,null,{"$f":"J1093+O1093","v":0}]
[null,null,null,null,null,null,null,null,null,null,null,null,null,null,null,{"$f":"J1094+O1094","v":0}]
[null,null,null,null,null,null,null,null,null,null,null,null,null,null,null,{"$f":"J1095+O1095","v":0}]
[null,null,null,null,null,null,null,null,null,null,null,null,null,null,null,{"$f":"J1096+O1096","v":0}]
[null,null,null,null,null,null,null,null,null,null,null,null,null,null,null,{"$f":"J1097+O1097","v":0}]
[null,null,null,null,null,null,null,null,null,null,null,null,null,null,null,{"$f":"J1098+O1098","v":0}]
[null,null,null,null,null,null,null,null,null,null,null,null,null,null,null,{"$f":"J1099+O1099","v":0}]
[null,null,null,null,null,null,null,null,null,null,null,null,null,null,null,{"$f":"J1100+O1100","v":0}]
[null,null,null,null,null,null,null,null,null,null,null,null,null,null,null,{"$f":"J1101+O1101","v":0}]
[null,null,null,null,null,null,null,null,null,null,null,null,null,null,null,{"$f":"J1102+O1102","v":0}]
[null,null,null,null,null,null,null,null,null,null,null,null,null,null,null,{"$f":"J1103+O1103","v":0}]
[null,null,null,null,null,null,null,null,null,null,null,null,null,null,null,{"$f":"J1104+O1104","v":0}]
[null,null,null,null,null,null,null,null,null,null,null,null,null,null,null,{"$f":"J1105+O1105","v":0}]
[null,null,null,null,null,null,null,null,null,null,null,null,null,null,null,{"$f":"J1106+O1106","v":0}]
[null,null,null,null,null,null,null,null,null,null,null,null,null,null,null,{"$f":"J1107+O1107","v":0}]
[null,null,null,null,null,null,null,null,null,null,null,null,null,null,null,{"$f":"J1108+O1108","v":0}]
[null,null,null,null,null,null,null,null,null,null,null,null,null,null,null,{"$f":"J1109+O1109","v":0}]
[null,null,null,null,null,null,null,null,null,null,null,null,null,null,null,{"$f":"J1110+O1110","v":0}]
[null,null,null,null,null,null,null,null,null,null,null,null,null,null,null,{"$f":"J1111+O1111","v":0}]
[null,null,null,null,null,null,null,null,null,null,null,null,null,null,null,{"$f":"J1112+O1112","v":0}]
[null,null,null,null,null,null,null,null,null,null,null,null,null,null,null,{"$f":"J1113+O1113","v":0}]
[null,null,null,null,null,null,null,null,null,null,null,null,null,null,null,{"$f":"J1114+O1114","v":0}]
[null,null,null,null,null,null,null,null,null,null,null,null,null,null,null,{"$f":"J1115+O1115","v":0}]
[null,null,null,null,null,null,null,null,null,null,null,null,null,null,null,{"$f":"J1116+O1116","v":0}]
[null,null,null,null,null,null,null,null,null,null,null,null,null,null,null,{"$f":"J1117+O1117","v":0}]
[null,null,null,null,null,null,null,null,null,null,null,null,null,null,null,{"$f":"J1118+O1118","v":0}]
[null,null,null,null,null,null,null,null,null,null,null,null,null,null,null,{"$f":"J1119+O1119","v":0}]
[null,null,null,null,null,null,null,null,null,null,null,null,null,null,null,{"$f":"J1120+O1120","v":0}]
[null,null,null,null,null,null,null,null,null,null,null,null,null,null,null,{"$f":"J1121+O1121","v":0}]
[null,null,null,null,null,null,null,null,null,null,null,null,null,null,null,{"$f":"J1122+O1122","v":0}]
[null,null,null,null,null,null,null,null,null,null,null,null,null,null,null,{"$f":"J1123+O1123","v":0}]
[null,null,null,null,null,null,null,null,null,null,null,null,null,null,null,{"$f":"J1124+O1124","v":0}]
[null,null,null,null,null,null,null,null,null,null,null,null,null,null,null,{"$f":"J1125+O1125","v":0}]
[null,null,null,null,null,null,null,null,null,null,null,null,null,null,null,{"$f":"J1126+O1126","v":0}]
[null,null,null,null,null,null,null,null,null,null,null,null,null,null,null,{"$f":"J1127+O1127","v":0}]
[null,null,null,null,null,null,null,null,null,null,null,null,null,null,null,{"$f":"J1128+O1128","v":0}]
[null,null,null,null,null,null,null,null,null,null,null,null,null,null,null,{"$f":"J1129+O1129","v":0}]
[null,null,null,null,null,null,null,null,null,null,null,null,null,null,null,{"$f":"J1130+O1130","v":0}]
[null,null,null,null,null,null,null,null,null,null,null,null,null,null,null,{"$f":"J1131+O1131","v":0}]
[null,null,null,null,null,null,null,null,null,null,null,null,null,null,null,{"$f":"J1132+O1132","v":0}]
[null,null,null,null,null,null,null,null,null,null,null,null,null,null,null,{"$f":"J1133+O1133","v":0}]
[null,null,null,null,null,null,null,null,null,null,null,null,null,null,null,{"$f":"J1134+O1134","v":0}]
[null,null,null,null,null,null,null,null,null,null,null,null,null,null,null,{"$f":"J1135+O1135","v":0}]
[null,null,null,null,null,null,null,null,null,null,null,null,null,null,null,{"$f":"J1136+O1136","v":0}]
[null,null,null,null,null,null,null,null,null,null,null,null,null,null,null,{"$f":"J1137+O1137","v":0}]
[null,null,null,null,null,null,null,null,null,null,null,null,null,null,null,{"$f":"J1138+O1138","v":0}]
[null,null,null,null,null,null,null,null,null,null,null,null,null,null,null,{"$f":"J1139+O1139","v":0}]
[null,null,null,null,null,null,null,null,null,null,null,null,null,null,null,{"$f":"J1140+O1140","v":0}]
[null,null,null,null,null,null,null,null,null,null,null,null,null,null,null,{"$f":"J1141+O1141","v":0}]
[null,null,null,null,null,null,null,null,null,null,null,null,null,null,null,{"$f":"J1142+O1142","v":0}]
[null,null,null,null,null,null,null,null,null,null,null,null,null,null,null,{"$f":"J1143+O1143","v":0}]
[null,null,null,null,null,null,null,null,null,null,null,null,null,null,null,{"$f":"J1144+O1144","v":0}]
[null,null,null,null,null,null,null,null,null,null,null,null,null,null,null,{"$f":"J1145+O1145","v":0}]
[null,null,null,null,null,null,null,null,null,null,null,null,null,null,null,{"$f":"J1146+O1146","v":0}]
[null,null,null,null,null,null,null,null,null,null,null,null,null,null,null,{"$f":"J1147+O1147","v":0}]
[null,null,null,null,null,null,null,null,null,null,null,null,null,null,null,{"$f":"J1148+O1148","v":0}]
[null,null,null,null,null,null,null,null,null,null,null,null,null,null,null,{"$f":"J1149+O1149","v":0}]
[null,null,null,null,null,null,null,null,null,null,null,null,null,null,null,{"$f":"J1150+O1150","v":0}]
[null,null,null,null,null,null,null,null,null,null,null,null,null,null,null,{"$f":"J1151+O1151","v":0}]
[null,null,null,null,null,null,null,null,null,null,null,null,null,null,null,{"$f":"J1152+O1152","v":0}]
[null,null,null,null,null,null,null,null,null,null,null,null,null,null,null,{"$f":"J1153+O1153","v":0}]
[null,null,null,null,null,null,null,null,null,null,null,null,null,null,null,{"$f":"J1154+O1154","v":0}]
[null,null,null,null,null,null,null,null,null,null,null,null,null,null,null,{"$f":"J1155+O1155","v":0}]
[null,null,null,null,null,null,null,null,null,null,null,null,null,null,null,{"$f":"J1156+O1156","v":0}]
[null,null,null,null,null,null,null,null,null,null,null,null,null,null,null,{"$f":"J1157+O1157","v":0}]
[null,null,null,null,null,null,null,null,null,null,null,null,null,null,null,{"$f":"J1158+O1158","v":0}]
[null,null,null,null,null,null,null,null,null,null,null,null,null,null,null,{"$f":"J1159+O1159","v":0}]
[null,null,null,null,null,null,null,null,null,null,null,null,null,null,null,{"$f":"J1160+O1160","v":0}]
[null,null,null,null,null,null,null,null,null,null,null,null,null,null,null,{"$f":"J1161+O1161","v":0}]
[null,null,null,null,null,null,null,null,null,null,null,null,null,null,null,{"$f":"J1162+O1162","v":0}]
[null,null,null,null,null,null,null,null,null,null,null,null,null,null,null,{"$f":"J1163+O1163","v":0}]
[null,null,null,null,null,null,null,null,null,null,null,null,null,null,null,{"$f":"J1164+O1164","v":0}]
[null,null,null,null,null,null,null,null,null,null,null,null,null,null,null,{"$f":"J1165+O1165","v":0}]
[null,null,null,null,null,null,null,null,null,null,null,null,null,null,null,{"$f":"J1166+O1166","v":0}]
[null,null,null,null,null,null,null,null,null,null,null,null,null,null,null,{"$f":"J1167+O1167","v":0}]
[null,null,null,null,null,null,null,null,null,null,null,null,null,null,null,{"$f":"J1168+O1168","v":0}]
[null,null,null,null,null,null,null,null,null,null,null,null,null,null,null,{"$f":"J1169+O1169","v":0}]
[null,null,null,null,null,null,null,null,null,null,null,null,null,null,null,{"$f":"J1170+O1170","v":0}]
[null,null,null,null,null,null,null,null,null,null,null,null,null,null,null,{"$f":"J1171+O1171","v":0}]
[null,null,null,null,null,null,null,null,null,null,null,null,null,null,null,{"$f":"J1172+O1172","v":0}]
[null,null,null,null,null,null,null,null,null,null,null,null,null,null,null,{"$f":"J1173+O1173","v":0}]
[null,null,null,null,null,null,null,null,null,null,null,null,null,null,null,{"$f":"J1174+O1174","v":0}]
[null,null,null,null,null,null,null,null,null,null,null,null,null,null,null,{"$f":"J1175+O1175","v":0}]
[null,null,null,null,null,null,null,null,null,null,null,null,null,null,null,{"$f":"J1176+O1176","v":0}]
[null,null,null,null,null,null,null,null,null,null,null,null,null,null,null,{"$f":"J1177+O1177","v":0}]
[null,null,null,null,null,null,null,null,null,null,null,null,null,null,null,{"$f":"J1178+O1178","v":0}]
[null,null,null,null,null,null,null,null,null,null,null,null,null,null,null,{"$f":"J1179+O1179","v":0}]
[null,null,null,null,null,null,null,null,null,null,null,null,null,null,null,{"$f":"J1180+O1180","v":0}]
[null,null,null,null,null,null,null,null,null,null,null,null,null,null,null,{"$f":"J1181+O1181","v":0}]
[null,null,null,null,null,null,null,null,null,null,null,null,null,null,null,{"$f":"J1182+O1182","v":0}]
[null,null,null,null,null,null,null,null,null,null,null,null,null,null,null,{"$f":"J1183+O1183","v":0}]
[null,null,null,null,null,null,null,null,null,null,null,null,null,null,null,{"$f":"J1184+O1184","v":0}]
[null,null,null,null,null,null,null,null,null,null,null,null,null,null,null,{"$f":"J1185+O1185","v":0}]
[null,null,null,null,null,null,null,null,null,null,null,null,null,null,null,{"$f":"J1186+O1186","v":0}]
[null,null,null,null,null,null,null,null,null,null,null,null,null,null,null,{"$f":"J1187+O1187","v":0}]
[null,null,null,null,null,null,null,null,null,null,null,null,null,null,null,{"$f":"J1188+O1188","v":0}]
[null,null,null,null,null,null,null,null,null,null,null,null,null,null,null,{"$f":"J1189+O1189","v":0}]
[null,null,null,null,null,null,null,null,null,null,null,null,null,null,null,{"$f":"J1190+O1190","v":0}]
[null,null,null,null,null,null,null,null,null,null,null,null,null,null,null,{"$f":"J1191+O1191","v":0}]
[null,null,null,null,null,null,null,null,null,null,null,null,null,null,null,{"$f":"J1192+O1192","v":0}]
[null,null,null,null,null,null,null,null,null,null,null,null,null,null,null,{"$f":"J1193+O1193","v":0}]
[null,null,null,null,null,null,null,null,null,null,null,null,null,null,null,{"$f":"J1194+O1194","v":0}]
[null,null,null,null,null,null,null,null,null,null,null,null,null,null,null,{"$f":"J1195+O1195","v":0}]
[null,null,null,null,null,null,null,null,null,null,null,null,null,null,null,{"$f":"J1196+O1196","v":0}]
[null,null,null,null,null,null,null,null,null,null,null,null,null,null,null,{"$f":"J1197+O1197","v":0}]
[null,null,null,null,null,null,null,null,null,null,null,null,null,null,null,{"$f":"J1198+O1198","v":0}]
[null,null,null,null,null,null,null,null,null,null,null,null,null,null,null,{"$f":"J1199+O1199","v":0}]
[null,null,null,null,null,null,null,null,null,null,null,null,null,null,null,{"$f":"J1200+O1200","v":0}]
[null,null,null,null,null,null,null,null,null,null,null,null,null,null,null,{"$f":"J1201+O1201","v":0}]
[null,null,null,null,null,null,null,null,null,null,null,null,null,null,null,{"$f":"J1202+O1202","v":0}]
[null,null,null,null,null,null,null,null,null,null,null,null,null,null,null,{"$f":"J1203+O1203","v":0}]
[null,null,null,null,null,null,null,null,null,null,null,null,null,null,null,{"$f":"J1204+O1204","v":0}]
[null,null,null,null,null,null,null,null,null,null,null,null,null,null,null,{"$f":"J1205+O1205","v":0}]
[null,null,null,null,null,null,null,null,null,null,null,null,null,null,null,{"$f":"J1206+O1206","v":0}]
[null,null,null,null,null,null,null,null,null,null,null,null,null,null,null,{"$f":"J1207+O1207","v":0}]
[null,null,null,null,null,null,null,null,null,null,null,null,null,null,null,{"$f":"J1208+O1208","v":0}]
[null,null,null,null,null,null,null,null,null,null,null,null,null,null,null,{"$f":"J1209+O1209","v":0}]
[null,null,null,null,null,null,null,null,null,null,null,null,null,null,null,{"$f":"J1210+O1210","v":0}]
[null,null,null,null,null,null,null,null,null,null,null,null,null,null,null,{"$f":"J1211+O1211","v":0}]
[null,null,null,null,null,null,null,null,null,null,null,null,null,null,null,{"$f":"J1212+O1212","v":0}]
[null,null,null,null,null,null,null,null,null,null,null,null,null,null,null,{"$f":"J1213+O1213","v":0}]
[null,null,null,null,null,null,null,null,null,null,null,null,null,null,null,{"$f":"J1214+O1214","v":0}]
[null,null,null,null,null,null,null,null,null,null,null,null,null,null,null,{"$f":"J1215+O1215","v":0}]
[null,null,null,null,null,null,null,null,null,null,null,null,null,null,null,{"$f":"J1216+O1216","v":0}]
[null,null,null,null,null,null,null,null,null,null,null,null,null,null,null,{"$f":"J1217+O1217","v":0}]
[null,null,null,null,null,null,null,null,null,null,null,null,null,null,null,{"$f":"J1218+O1218","v":0}]
[null,null,null,null,null,null,null,null,null,null,null,null,null,null,null,{"$f":"J1219+O1219","v":0}]
[null,null,null,null,null,null,null,null,null,null,null,null,null,null,null,{"$f":"J1220+O1220","v":0}]
[null,null,null,null,null,null,null,null,null,null,null,null,null,null,null,{"$f":"J1221+O1221","v":0}]
[null,null,null,null,null,null,null,null,null,null,null,null,null,null,null,{"$f":"J1222+O1222","v":0}]
[null,null,null,null,null,null,null,null,null,null,null,null,null,null,null,{"$f":"J1223+O1223","v":0}]
[null,null,null,null,null,null,null,null,null,null,null,null,null,null,null,{"$f":"J1224+O1224","v":0}]
[null,null,null,null,null,null,null,null,null,null,null,null,null,null,null,{"$f":"J1225+O1225","v":0}]
[null,null,null,null,null,null,null,null,null,null,null,null,null,null,null,{"$f":"J1226+O1226","v":0}]
[null,null,null,null,null,null,null,null,null,null,null,null,null,null,null,{"$f":"J1227+O1227","v":0}]
[null,null,null,null,null,null,null,null,null,null,null,null,null,null,null,{"$f":"J1228+O1228","v":0}]
[null,null,null,null,null,null,null,null,null,null,null,null,null,null,null,{"$f":"J1229+O1229","v":0}]
[null,null,null,null,null,null,null,null,null,null,null,null,null,null,null,{"$f":"J1230+O1230","v":0}]
[null,null,null,null,null,null,null,null,null,null,null,null,null,null,null,{"$f":"J1231+O1231","v":0}]
[null,null,null,null,null,null,null,null,null,null,null,null,null,null,null,{"$f":"J1232+O1232","v":0}]
[null,null,null,null,null,null,null,null,null,null,null,null,null,null,null,{"$f":"J1233+O1233","v":0}]
[null,null,null,null,null,null,null,null,null,null,null,null,null,null,null,{"$f":"J1234+O1234","v":0}]
[null,null,null,null,null,null,null,null,null,null,null,null,null,null,null,{"$f":"J1235+O1235","v":0}]
[null,null,null,null,null,null,null,null,null,null,null,null,null,null,null,{"$f":"J1236+O1236","v":0}]
[null,null,null,null,null,null,null,null,null,null,null,null,null,null,null,{"$f":"J1237+O1237","v":0}]
[null,null,null,null,null,null,null,null,null,null,null,null,null,null,null,{"$f":"J1238+O1238","v":0}]
[null,null,null,null,null,null,null,null,null,null,null,null,null,null,null,{"$f":"J1239+O1239","v":0}]
[null,null,null,null,null,null,null,null,null,null,null,null,null,null,null,{"$f":"J1240+O1240","v":0}]
[null,null,null,null,null,null,null,null,null,null,null,null,null,null,null,{"$f":"J1241+O1241","v":0}]
[null,null,null,null,null,null,null,null,null,null,null,null,null,null,null,{"$f":"J1242+O1242","v":0}]
[null,null,null,null,null,null,null,null,null,null,null,null,null,null,null,{"$f":"J1243+O1243","v":0}]
[null,null,null,null,null,null,null,null,null,null,null,null,null,null,null,{"$f":"J1244+O1244","v":0}]
[null,null,null,null,null,null,null,null,null,null,null,null,null,null,null,{"$f":"J1245+O1245","v":0}]
[null,null,null,null,null,null,null,null,null,null,null,null,null,null,null,{"$f":"J1246+O1246","v":0}]
[null,null,null,null,null,null,null,null,null,null,null,null,null,null,null,{"$f":"J1247+O1247","v":0}]
[null,null,null,null,null,null,null,null,null,null,null,null,null,null,null,{"$f":"J1248+O1248","v":0}]
[null,null,null,null,null,null,null,null,null,null,null,null,null,null,null,{"$f":"J1249+O1249","v":0}]
[null,null,null,null,null,null,null,null,null,null,null,null,null,null,null,{"$f":"J1250+O1250","v":0}]
[null,null,null,null,null,null,null,null,null,null,null,null,null,null,null,{"$f":"J1251+O1251","v":0}]
[null,null,null,null,null,null,null,null,null,null,null,null,null,null,null,{"$f":"J1252+O1252","v":0}]
[null,null,null,null,null,null,null,null,null,null,null,null,null,null,null,{"$f":"J1253+O1253","v":0}]
[null,null,null,null,null,null,null,null,null,null,null,null,null,null,null,{"$f":"J1254+O1254","v":0}]
[null,null,null,null,null,null,null,null,null,null,null,null,null,null,null,{"$f":"J1255+O1255","v":0}]
[null,null,null,null,null,null,null,null,null,null,null,null,null,null,null,{"$f":"J1256+O1256","v":0}]
[null,null,null,null,null,null,null,null,null,null,null,null,null,null,null,{"$f":"J1257+O1257","v":0}]
[null,null,null,null,null,null,null,null,null,null,null,null,null,null,null,{"$f":"J1258+O1258","v":0}]
[null,null,null,null,null,null,null,null,null,null,null,null,null,null,null,{"$f":"J1259+O1259","v":0}]
[null,null,null,null,null,null,null,null,null,null,null,null,null,null,null,{"$f":"J1260+O1260","v":0}]
[null,null,null,null,null,null,null,null,null,null,null,null,null,null,null,{"$f":"J1261+O1261","v":0}]
[null,null,null,null,null,null,null,null,null,null,null,null,null,null,null,{"$f":"J1262+O1262","v":0}]
[null,null,null,null,null,null,null,null,null,null,null,null,null,null,null,{"$f":"J1263+O1263","v":0}]
[null,null,null,null,null,null,null,null,null,null,null,null,null,null,null,{"$f":"J1264+O1264","v":0}]
[null,null,null,null,null,null,null,null,null,null,null,null,null,null,null,{"$f":"J1265+O1265","v":0}]
[null,null,null,null,null,null,null,null,null,null,null,null,null,null,null,{"$f":"J1266+O1266","v":0}]
[null,null,null,null,null,null,null,null,null,null,null,null,null,null,null,{"$f":"J1267+O1267","v":0}]
[null,null,null,null,null,null,null,null,null,null,null,null,null,null,null,{"$f":"J1268+O1268","v":0}]
[null,null,null,null,null,null,null,null,null,null,null,null,null,null,null,{"$f":"J1269+O1269","v":0}]
[null,null,null,null,null,null,null,null,null,null,null,null,null,null,null,{"$f":"J1270+O1270","v":0}]
[null,null,null,null,null,null,null,null,null,null,null,null,null,null,null,{"$f":"J1271+O1271","v":0}]
[null,null,null,null,null,null,null,null,null,null,null,null,null,null,null,{"$f":"J1272+O1272","v":0}]
[null,null,null,null,null,null,null,null,null,null,null,null,null,null,null,{"$f":"J1273+O1273","v":0}]
[null,null,null,null,null,null,null,null,null,null,null,null,null,null,null,{"$f":"J1274+O1274","v":0}]
[null,null,null,null,null,null,null,null,null,null,null,null,null,null,null,{"$f":"J1275+O1275","v":0}]
[null,null,null,null,null,null,null,null,null,null,null,null,null,null,null,{"$f":"J1276+O1276","v":0}]
[null,null,null,null,null,null,null,null,null,null,null,null,null,null,null,{"$f":"J1277+O1277","v":0}]
[null,null,null,null,null,null,null,null,null,null,null,null,null,null,null,{"$f":"J1278+O1278","v":0}]
[null,null,null,null,null,null,null,null,null,null,null,null,null,null,null,{"$f":"J1279+O1279","v":0}]
[null,null,null,null,null,null,null,null,null,null,null,null,null,null,null,{"$f":"J1280+O1280","v":0}]
[null,null,null,null,null,null,null,null,null,null,null,null,null,null,null,{"$f":"J1281+O1281","v":0}]
[null,null,null,null,null,null,null,null,null,null,null,null,null,null,null,{"$f":"J1282+O1282","v":0}]
[null,null,null,null,null,null,null,null,null,null,null,null,null,null,null,{"$f":"J1283+O1283","v":0}]
[null,null,null,null,null,null,null,null,null,null,null,null,null,null,null,{"$f":"J1284+O1284","v":0}]
[null,null,null,null,null,null,null,null,null,null,null,null,null,null,null,{"$f":"J1285+O1285","v":0}]
[null,null,null,null,null,null,null,null,null,null,null,null,null,null,null,{"$f":"J1286+O1286","v":0}]
[null,null,null,null,null,null,null,null,null,null,null,null,null,null,null,{"$f":"J1287+O1287","v":0}]
[null,null,null,null,null,null,null,null,null,null,null,null,null,null,null,{"$f":"J1288+O1288","v":0}]
[null,null,null,null,null,null,null,null,null,null,null,null,null,null,null,{"$f":"J1289+O1289","v":0}]
[null,null,null,null,null,null,null,null,null,null,null,null,null,null,null,{"$f":"J1290+O1290","v":0}]
[null,null,null,null,null,null,null,null,null,null,null,null,null,null,null,{"$f":"J1291+O1291","v":0}]
[null,null,null,null,null,null,null,null,null,null,null,null,null,null,null,{"$f":"J1292+O1292","v":0}]
[null,null,null,null,null,null,null,null,null,null,null,null,null,null,null,{"$f":"J1293+O1293","v":0}]
[null,null,null,null,null,null,null,null,null,null,null,null,null,null,null,{"$f":"J1294+O1294","v":0}]
[null,null,null,null,null,null,null,null,null,null,null,null,null,null,null,{"$f":"J1295+O1295","v":0}]
[null,null,null,null,null,null,null,null,null,null,null,null,null,null,null,{"$f":"J1296+O1296","v":0}]
[null,null,null,null,null,null,null,null,null,null,null,null,null,null,null,{"$f":"J1297+O1297","v":0}]
[null,null,null,null,null,null,null,null,null,null,null,null,null,null,null,{"$f":"J1298+O1298","v":0}]
[null,null,null,null,null,null,null,null,null,null,null,null,null,null,null,{"$f":"J1299+O1299","v":0}]
[null,null,null,null,null,null,null,null,null,null,null,null,null,null,null,{"$f":"J1300+O1300","v":0}]
[null,null,null,null,null,null,null,null,null,null,null,null,null,null,null,{"$f":"J1301+O1301","v":0}]
[null,null,null,null,null,null,null,null,null,null,null,null,null,null,null,{"$f":"J1302+O1302","v":0}]
[null,null,null,null,null,null,null,null,null,null,null,null,null,null,null,{"$f":"J1303+O1303","v":0}]
[null,null,null,null,null,null,null,null,null,null,null,null,null,null,null,{"$f":"J1304+O1304","v":0}]
[null,null,null,null,null,null,null,null,null,null,null,null,null,null,null,{"$f":"J1305+O1305","v":0}]
[null,null,null,null,null,null,null,null,null,null,null,null,null,null,null,{"$f":"J1306+O1306","v":0}]
[null,null,null,null,null,null,null,null,null,null,null,null,null,null,null,{"$f":"J1307+O1307","v":0}]
[null,null,null,null,null,null,null,null,null,null,null,null,null,null,null,{"$f":"J1308+O1308","v":0}]
[null,null,null,null,null,null,null,null,null,null,null,null,null,null,null,{"$f":"J1309+O1309","v":0}]
[null,null,null,null,null,null,null,null,null,null,null,null,null,null,null,{"$f":"J1310+O1310","v":0}]
[null,null,null,null,null,null,null,null,null,null,null,null,null,null,null,{"$f":"J1311+O1311","v":0}]
[null,null,null,null,null,null,null,null,null,null,null,null,null,null,null,{"$f":"J1312+O1312","v":0}]
[null,null,null,null,null,null,null,null,null,null,null,null,null,null,null,{"$f":"J1313+O1313","v":0}]
[null,null,null,null,null,null,null,null,null,null,null,null,null,null,null,{"$f":"J1314+O1314","v":0}]
[null,null,null,null,null,null,null,null,null,null,null,null,null,null,null,{"$f":"J1315+O1315","v":0}]
[null,null,null,null,null,null,null,null,null,null,null,null,null,null,null,{"$f":"J1316+O1316","v":0}]
[null,null,null,null,null,null,null,null,null,null,null,null,null,null,null,{"$f":"J1317+O1317","v":0}]
[null,null,null,null,null,null,null,null,null,null,null,null,null,null,null,{"$f":"J1318+O1318","v":0}]
[null,null,null,null,null,null,null,null,null,null,null,null,null,null,null,{"$f":"J1319+O1319","v":0}]
[null,null,null,null,null,null,null,null,null,null,null,null,null,null,null,{"$f":"J1320+O1320","v":0}]
[null,null,null,null,null,null,null,null,null,null,null,null,null,null,null,{"$f":"J1321+O1321","v":0}]
[null,null,null,null,null,null,null,null,null,null,null,null,null,null,null,{"$f":"J1322+O1322","v":0}]
[null,null,null,null,null,null,null,null,null,null,null,null,null,null,null,{"$f":"J1323+O1323","v":0}]
[null,null,null,null,null,null,null,null,null,null,null,null,null,null,null,{"$f":"J1324+O1324","v":0}]
[null,null,null,null,null,null,null,null,null,null,null,null,null,null,null,{"$f":"J1325+O1325","v":0}]
[null,null,null,null,null,null,null,null,null,null,null,null,null,null,null,{"$f":"J1326+O1326","v":0}]
[null,null,null,null,null,null,null,null,null,null,null,null,null,null,null,{"$f":"J1327+O1327","v":0}]
[null,null,null,null,null,null,null,null,null,null,null,null,null,null,null,{"$f":"J1328+O1328","v":0}]
[null,null,null,null,null,null,null,null,null,null,null,null,null,null,null,{"$f":"J1329+O1329","v":0}]
[null,null,null,null,null,null,null,null,null,null,null,null,null,null,null,{"$f":"J1330+O1330","v":0}]
[null,null,null,null,null,null,null,null,null,null,null,null,null,null,null,{"$f":"J1331+O1331","v":0}]
[null,null,null,null,null,null,null,null,null,null,null,null,null,null,null,{"$f":"J1332+O1332","v":0}]
[null,null,null,null,null,null,null,null,null,null,null,null,null,null,null,{"$f":"J1333+O1333","v":0}]
[null,null,null,null,null,null,null,null,null,null,null,null,null,null,null,{"$f":"J1334+O1334","v":0}]
[null,null,null,null,null,null,null,null,null,null,null,null,null,null,null,{"$f":"J1335+O1335","v":0}]
[null,null,null,null,null,null,null,null,null,null,null,null,null,null,null,{"$f":"J1336+O1336","v":0}]
[null,null,null,null,null,null,null,null,null,null,null,null,null,null,null,{"$f":"J1337+O1337","v":0}]
[null,null,null,null,null,null,null,null,null,null,null,null,null,null,null,{"$f":"J1338+O1338","v":0}]
[null,null,null,null,null,null,null,null,null,null,null,null,null,null,null,{"$f":"J1339+O1339","v":0}]
[null,null,null,null,null,null,null,null,null,null,null,null,null,null,null,{"$f":"J1340+O1340","v":0}]
[null,null,null,null,null,null,null,null,null,null,null,null,null,null,null,{"$f":"J1341+O1341","v":0}]
[null,null,null,null,null,null,null,null,null,null,null,null,null,null,null,{"$f":"J1342+O1342","v":0}]
[null,null,null,null,null,null,null,null,null,null,null,null,null,null,null,{"$f":"J1343+O1343","v":0}]
[null,null,null,null,null,null,null,null,null,null,null,null,null,null,null,{"$f":"J1344+O1344","v":0}]
[null,null,null,null,null,null,null,null,null,null,null,null,null,null,null,{"$f":"J1345+O1345","v":0}]
[null,null,null,null,null,null,null,null,null,null,null,null,null,null,null,{"$f":"J1346+O1346","v":0}]
[null,null,null,null,null,null,null,null,null,null,null,null,null,null,null,{"$f":"J1347+O1347","v":0}]
[null,null,null,null,null,null,null,null,null,null,null,null,null,null,null,{"$f":"J1348+O1348","v":0}]
[null,null,null,null,null,null,null,null,null,null,null,null,null,null,null,{"$f":"J1349+O1349","v":0}]
[null,null,null,null,null,null,null,null,null,null,null,null,null,null,null,{"$f":"J1350+O1350","v":0}]
[null,null,null,null,null,null,null,null,null,null,null,null,null,null,null,{"$f":"J1351+O1351","v":0}]
[null,null,null,null,null,null,null,null,null,null,null,null,null,null,null,{"$f":"J1352+O1352","v":0}]
[null,null,null,null,null,null,null,null,null,null,null,null,null,null,null,{"$f":"J1353+O1353","v":0}]
[null,null,null,null,null,null,null,null,null,null,null,null,null,null,null,{"$f":"J1354+O1354","v":0}]
[null,null,null,null,null,null,null,null,null,null,null,null,null,null,null,{"$f":"J1355+O1355","v":0}]
[null,null,null,null,null,null,null,null,null,null,null,null,null,null,null,{"$f":"J1356+O1356","v":0}]
[null,null,null,null,null,null,null,null,null,null,null,null,null,null,null,{"$f":"J1357+O1357","v":0}]
[null,null,null,null,null,null,null,null,null,null,null,null,null,null,null,{"$f":"J1358+O1358","v":0}]
[null,null,null,null,null,null,null,null,null,null,null,null,null,null,null,{"$f":"J1359+O1359","v":0}]
[null,null,null,null,null,null,null,null,null,null,null,null,null,null,null,{"$f":"J1360+O1360","v":0}]
[null,null,null,null,null,null,null,null,null,null,null,null,null,null,null,{"$f":"J1361+O1361","v":0}]
[null,null,null,null,null,null,null,null,null,null,null,null,null,null,null,{"$f":"J1362+O1362","v":0}]
[null,null,null,null,null,null,null,null,null,null,null,null,null,null,null,{"$f":"J1363+O1363","v":0}]
[null,null,null,null,null,null,null,null,null,null,null,null,null,null,null,{"$f":"J1364+O1364","v":0}]
[null,null,null,null,null,null,null,null,null,null,null,null,null,null,null,{"$f":"J1365+O1365","v":0}]
[null,null,null,null,null,null,null,null,null,null,null,null,null,null,null,{"$f":"J1366+O1366","v":0}]
[null,null,null,null,null,null,null,null,null,null,null,null,null,null,null,{"$f":"J1367+O1367","v":0}]
[null,null,null,null,null,null,null,null,null,null,null,null,null,null,null,{"$f":"J1368+O1368","v":0}]
[null,null,null,null,null,null,null,null,null,null,null,null,null,null,null,{"$f":"J1369+O1369","v":0}]
[null,null,null,null,null,null,null,null,null,null,null,null,null,null,null,{"$f":"J1370+O1370","v":0}]
[null,null,null,null,null,null,null,null,null,null,null,null,null,null,null,{"$f":"J1371+O1371","v":0}]
[null,null,null,null,null,null,null,null,null,null,null,null,null,null,null,{"$f":"J1372+O1372","v":0}]
[null,null,null,null,null,null,null,null,null,null,null,null,null,null,null,{"$f":"J1373+O1373","v":0}]
[null,null,null,null,null,null,null,null,null,null,null,null,null,null,null,{"$f":"J1374+O1374","v":0}]
[null,null,null,null,null,null,null,null,null,null,null,null,null,null,null,{"$f":"J1375+O1375","v":0}]
[null,null,null,null,null,null,null,null,null,null,null,null,null,null,null,{"$f":"J1376+O1376","v":0}]
[null,null,null,null,null,null,null,null,null,null,null,null,null,null,null,{"$f":"J1377+O1377","v":0}]
[null,null,null,null,null,null,null,null,null,null,null,null,null,null,null,{"$f":"J1378+O1378","v":0}]
[null,null,null,null,null,null,null,null,null,null,null,null,null,null,null,{"$f":"J1379+O1379","v":0}]
[null,null,null,null,null,null,null,null,null,null,null,null,null,null,null,{"$f":"J1380+O1380","v":0}]
[null,null,null,null,null,null,null,null,null,null,null,null,null,null,null,{"$f":"J1381+O1381","v":0}]
[null,null,null,null,null,null,null,null,null,null,null,null,null,null,null,{"$f":"J1382+O1382","v":0}]
[null,null,null,null,null,null,null,null,null,null,null,null,null,null,null,{"$f":"J1383+O1383","v":0}]
[null,null,null,null,null,null,null,null,null,null,null,null,null,null,null,{"$f":"J1384+O1384","v":0}]
[null,null,null,null,null,null,null,null,null,null,null,null,null,null,null,{"$f":"J1385+O1385","v":0}]
[null,null,null,null,null,null,null,null,null,null,null,null,null,null,null,{"$f":"J1386+O1386","v":0}]
[null,null,null,null,null,null,null,null,null,null,null,null,null,null,null,{"$f":"J1387+O1387","v":0}]
[null,null,null,null,null,null,null,null,null,null,null,null,null,null,null,{"$f":"J1388+O1388","v":0}]
[null,null,null,null,null,null,null,null,null,null,null,null,null,null,null,{"$f":"J1389+O1389","v":0}]
[null,null,null,null,null,null,null,null,null,null,null,null,null,null,null,{"$f":"J1390+O1390","v":0}]
[null,null,null,null,null,null,null,null,null,null,null,null,null,null,null,{"$f":"J1391+O1391","v":0}]
[null,null,null,null,null,null,null,null,null,null,null,null,null,null,null,{"$f":"J1392+O1392","v":0}]
[null,null,null,null,null,null,null,null,null,null,null,null,null,null,null,{"$f":"J1393+O1393","v":0}]
[null,null,null,null,null,null,null,null,null,null,null,null,null,null,null,{"$f":"J1394+O1394","v":0}]
[null,null,null,null,null,null,null,null,null,null,null,null,null,null,null,{"$f":"J1395+O1395","v":0}]
[null,null,null,null,null,null,null,null,null,null,null,null,null,null,null,{"$f":"J1396+O1396","v":0}]
[null,null,null,null,null,null,null,null,null,null,null,null,null,null,null,{"$f":"J1397+O1397","v":0}]
[null,null,null,null,null,null,null,null,null,null,null,null,null,null,null,{"$f":"J1398+O1398","v":0}]
[null,null,null,null,null,null,null,null,null,null,null,null,null,null,null,{"$f":"J1399+O1399","v":0}]
[null,null,null,null,null,null,null,null,null,null,null,null,null,null,null,{"$f":"J1400+O1400","v":0}]
[null,null,null,null,null,null,null,null,null,null,null,null,null,null,null,{"$f":"J1401+O1401","v":0}]
[null,null,null,null,null,null,null,null,null,null,null,null,null,null,null,{"$f":"J1402+O1402","v":0}]
[null,null,null,null,null,null,null,null,null,null,null,null,null,null,null,{"$f":"J1403+O1403","v":0}]
[null,null,null,null,null,null,null,null,null,null,null,null,null,null,null,{"$f":"J1404+O1404","v":0}]
[null,null,null,null,null,null,null,null,null,null,null,null,null,null,null,{"$f":"J1405+O1405","v":0}]
[null,null,null,null,null,null,null,null,null,null,null,null,null,null,null,{"$f":"J1406+O1406","v":0}]
[null,null,null,null,null,null,null,null,null,null,null,null,null,null,null,{"$f":"J1407+O1407","v":0}]
[null,null,null,null,null,null,null,null,null,null,null,null,null,null,null,{"$f":"J1408+O1408","v":0}]
[null,null,null,null,null,null,null,null,null,null,null,null,null,null,null,{"$f":"J1409+O1409","v":0}]
[null,null,null,null,null,null,null,null,null,null,null,null,null,null,null,{"$f":"J1410+O1410","v":0}]
[null,null,null,null,null,null,null,null,null,null,null,null,null,null,null,{"$f":"J1411+O1411","v":0}]
[null,null,null,null,null,null,null,null,null,null,null,null,null,null,null,{"$f":"J1412+O1412","v":0}]
[null,null,null,null,null,null,null,null,null,null,null,null,null,null,null,{"$f":"J1413+O1413","v":0}]
[null,null,null,null,null,null,null,null,null,null,null,null,null,null,null,{"$f":"J1414+O1414","v":0}]
[null,null,null,null,null,null,null,null,null,null,null,null,null,null,null,{"$f":"J1415+O1415","v":0}]
[null,null,null,null,null,null,null,null,null,null,null,null,null,null,null,{"$f":"J1416+O1416","v":0}]
[null,null,null,null,null,null,null,null,null,null,null,null,null,null,null,{"$f":"J1417+O1417","v":0}]
[null,null,null,null,null,null,null,null,null,null,null,null,null,null,null,{"$f":"J1418+O1418","v":0}]
[null,null,null,null,null,null,null,null,null,null,null,null,null,null,null,{"$f":"J1419+O1419","v":0}]
[null,null,null,null,null,null,null,null,null,null,null,null,null,null,null,{"$f":"J1420+O1420","v":0}]
[null,null,null,null,null,null,null,null,null,null,null,null,null,null,null,{"$f":"J1421+O1421","v":0}]
[null,null,null,null,null,null,null,null,null,null,null,null,null,null,null,{"$f":"J1422+O1422","v":0}]
[null,null,null,null,null,null,null,null,null,null,null,null,null,null,null,{"$f":"J1423+O1423","v":0}]
[null,null,null,null,null,null,null,null,null,null,null,null,null,null,null,{"$f":"J1424+O1424","v":0}]
[null,null,null,null,null,null,null,null,null,null,null,null,null,null,null,{"$f":"J1425+O1425","v":0}]
[null,null,null,null,null,null,null,null,null,null,null,null,null,null,null,{"$f":"J1426+O1426","v":0}]
[null,null,null,null,null,null,null,null,null,null,null,null,null,null,null,{"$f":"J1427+O1427","v":0}]
[null,null,null,null,null,null,null,null,null,null,null,null,null,null,null,{"$f":"J1428+O1428","v":0}]
[null,null,null,null,null,null,null,null,null,null,null,null,null,null,null,{"$f":"J1429+O1429","v":0}]
[null,null,null,null,null,null,null,null,null,null,null,null,null,null,null,{"$f":"J1430+O1430","v":0}]
[null,null,null,null,null,null,null,null,null,null,null,null,null,null,null,{"$f":"J1431+O1431","v":0}]
[null,null,null,null,null,null,null,null,null,null,null,null,null,null,null,{"$f":"J1432+O1432","v":0}]
[null,null,null,null,null,null,null,null,null,null,null,null,null,null,null,{"$f":"J1433+O1433","v":0}]
[null,null,null,null,null,null,null,null,null,null,null,null,null,null,null,{"$f":"J1434+O1434","v":0}]
[null,null,null,null,null,null,null,null,null,null,null,null,null,null,null,{"$f":"J1435+O1435","v":0}]
[null,null,null,null,null,null,null,null,null,null,null,null,null,null,null,{"$f":"J1436+O1436","v":0}]
[null,null,null,null,null,null,null,null,null,null,null,null,null,null,null,{"$f":"J1437+O1437","v":0}]
[null,null,null,null,null,null,null,null,null,null,null,null,null,null,null,{"$f":"J1438+O1438","v":0}]
[null,null,null,null,null,null,null,null,null,null,null,null,null,null,null,{"$f":"J1439+O1439","v":0}]
[null,null,null,null,null,null,null,null,null,null,null,null,null,null,null,{"$f":"J1440+O1440","v":0}]
[null,null,null,null,null,null,null,null,null,null,null,null,null,null,null,{"$f":"J1441+O1441","v":0}]
[null,null,null,null,null,null,null,null,null,null,null,null,null,null,null,{"$f":"J1442+O1442","v":0}]
[null,null,null,null,null,null,null,null,null,null,null,null,null,null,null,{"$f":"J1443+O1443","v":0}]
[null,null,null,null,null,null,null,null,null,null,null,null,null,null,null,{"$f":"J1444+O1444","v":0}]
[null,null,null,null,null,null,null,null,null,null,null,null,null,null,null,{"$f":"J1445+O1445","v":0}]
[null,null,null,null,null,null,null,null,null,null,null,null,null,null,null,{"$f":"J1446+O1446","v":0}]
[null,null,null,null,null,null,null,null,null,null,null,null,null,null,null,{"$f":"J1447+O1447","v":0}]
[null,null,null,null,null,null,null,null,null,null,null,null,null,null,null,{"$f":"J1448+O1448","v":0}]
[null,null,null,null,null,null,null,null,null,null,null,null,null,null,null,{"$f":"J1449+O1449","v":0}]
[null,null,null,null,null,null,null,null,null,null,null,null,null,null,null,{"$f":"J1450+O1450","v":0}]
[null,null,null,null,null,null,null,null,null,null,null,null,null,null,null,{"$f":"J1451+O1451","v":0}]
[null,null,null,null,null,null,null,null,null,null,null,null,null,null,null,{"$f":"J1452+O1452","v":0}]
[null,null,null,null,null,null,null,null,null,null,null,null,null,null,null,{"$f":"J1453+O1453","v":0}]
[null,null,null,null,null,null,null,null,null,null,null,null,null,null,null,{"$f":"J1454+O1454","v":0}]
[null,null,null,null,null,null,null,null,null,null,null,null,null,null,null,{"$f":"J1455+O1455","v":0}]
[null,null,null,null,null,null,null,null,null,null,null,null,null,null,null,{"$f":"J1456+O1456","v":0}]
[null,null,null,null,null,null,null,null,null,null,null,null,null,null,null,{"$f":"J1457+O1457","v":0}]
[null,null,null,null,null,null,null,null,null,null,null,null,null,null,null,{"$f":"J1458+O1458","v":0}]
[null,null,null,null,null,null,null,null,null,null,null,null,null,null,null,{"$f":"J1459+O1459","v":0}]
[null,null,null,null,null,null,null,null,null,null,null,null,null,null,null,{"$f":"J1460+O1460","v":0}]
[null,null,null,null,null,null,null,null,null,null,null,null,null,null,null,{"$f":"J1461+O1461","v":0}]
[null,null,null,null,null,null,null,null,null,null,null,null,null,null,null,{"$f":"J1462+O1462","v":0}]
[null,null,null,null,null,null,null,null,null,null,null,null,null,null,null,{"$f":"J1463+O1463","v":0}]
[null,null,null,null,null,null,null,null,null,null,null,null,null,null,null,{"$f":"J1464+O1464","v":0}]
[null,null,null,null,null,null,null,null,null,null,null,null,null,null,null,{"$f":"J1465+O1465","v":0}]
[null,null,null,null,null,null,null,null,null,null,null,null,null,null,null,{"$f":"J1466+O1466","v":0}]
[null,null,null,null,null,null,null,null,null,null,null,null,null,null,null,{"$f":"J1467+O1467","v":0}]
[null,null,null,null,null,null,null,null,null,null,null,null,null,null,null,{"$f":"J1468+O1468","v":0}]
[null,null,null,null,null,null,null,null,null,null,null,null,null,null,null,{"$f":"J1469+O1469","v":0}]
[null,null,null,null,null,null,null,null,null,null,null,null,null,null,null,{"$f":"J1470+O1470","v":0}]
[null,null,null,null,null,null,null,null,null,null,null,null,null,null,null,{"$f":"J1471+O1471","v":0}]
[null,null,null,null,null,null,null,null,null,null,null,null,null,null,null,{"$f":"J1472+O1472","v":0}]
[null,null,null,null,null,null,null,null,null,null,null,null,null,null,null,{"$f":"J1473+O1473","v":0}]
[null,null,null,null,null,null,null,null,null,null,null,null,null,null,null,{"$f":"J1474+O1474","v":0}]
[null,null,null,null,null,null,null,null,null,null,null,null,null,null,null,{"$f":"J1475+O1475","v":0}]
[null,null,null,null,null,null,null,null,null,null,null,null,null,null,null,{"$f":"J1476+O1476","v":0}]
[null,null,null,null,null,null,null,null,null,null,null,null,null,null,null,{"$f":"J1477+O1477","v":0}]
[null,null,null,null,null,null,null,null,null,null,null,null,null,null,null,{"$f":"J1478+O1478","v":0}]
[null,null,null,null,null,null,null,null,null,null,null,null,null,null,null,{"$f":"J1479+O1479","v":0}]
[null,null,null,null,null,null,null,null,null,null,null,null,null,null,null,{"$f":"J1480+O1480","v":0}]
[null,null,null,null,null,null,null,null,null,null,null,null,null,null,null,{"$f":"J1481+O1481","v":0}]
[null,null,null,null,null,null,null,null,null,null,null,null,null,null,null,{"$f":"J1482+O1482","v":0}]
[null,null,null,null,null,null,null,null,null,null,null,null,null,null,null,{"$f":"J1483+O1483","v":0}]
[null,null,null,null,null,null,null,null,null,null,null,null,null,null,null,{"$f":"J1484+O1484","v":0}]
[null,null,null,null,null,null,null,null,null,null,null,null,null,null,null,{"$f":"J1485+O1485","v":0}]
[null,null,null,null,null,null,null,null,null,null,null,null,null,null,null,{"$f":"J1486+O1486","v":0}]
[null,null,null,null,null,null,null,null,null,null,null,null,null,null,null,{"$f":"J1487+O1487","v":0}]
[null,null,null,null,null,null,null,null,null,null,null,null,null,null,null,{"$f":"J1488+O1488","v":0}]
[null,null,null,null,null,null,null,null,null,null,null,null,null,null,null,{"$f":"J1489+O1489","v":0}]
[null,null,null,null,null,null,null,null,null,null,null,null,null,null,null,{"$f":"J1490+O1490","v":0}]
[null,null,null,null,null,null,null,null,null,null,null,null,null,null,null,{"$f":"J1491+O1491","v":0}]
[null,null,null,null,null,null,null,null,null,null,null,null,null,null,null,{"$f":"J1492+O1492","v":0}]
[null,null,null,null,null,null,null,null,null,null,null,null,null,null,null,{"$f":"J1493+O1493","v":0}]
[null,null,null,null,null,null,null,null,null,null,null,null,null,null,null,{"$f":"J1494+O1494","v":0}]
[null,null,null,null,null,null,null,null,null,null,null,null,null,null,null,{"$f":"J1495+O1495","v":0}]
[null,null,null,null,null,null,null,null,null,null,null,null,null,null,null,{"$f":"J1496+O1496","v":0}]
[null,null,null,null,null,null,null,null,null,null,null,null,null,null,null,{"$f":"J1497+O1497","v":0}]
[null,null,null,null,null,null,null,null,null,null,null,null,null,null,null,{"$f":"J1498+O1498","v":0}]
[null,null,null,null,null,null,null,null,null,null,null,null,null,null,null,{"$f":"J1499+O1499","v":0}]
[null,null,null,null,null,null,null,null,null,null,null,null,null,null,null,{"$f":"J1500+O1500","v":0}]
[null,null,null,null,null,null,null,null,null,null,null,null,null,null,null,{"$f":"J1501+O1501","v":0}]
[null,null,null,null,null,null,null,null,null,null,null,null,null,null,null,{"$f":"J1502+O1502","v":0}]
[null,null,null,null,null,null,null,null,null,null,null,null,null,null,null,{"$f":"J1503+O1503","v":0}]
[null,null,null,null,null,null,null,null,null,null,null,null,null,null,null,{"$f":"J1504+O1504","v":0}]
[null,null,null,null,null,null,null,null,null,null,null,null,null,null,null,{"$f":"J1505+O1505","v":0}]
[null,null,null,null,null,null,null,null,null,null,null,null,null,null,null,{"$f":"J1506+O1506","v":0}]
[null,null,null,null,null,null,null,null,null,null,null,null,null,null,null,{"$f":"J1507+O1507","v":0}]
[null,null,null,null,null,null,null,null,null,null,null,null,null,null,null,{"$f":"J1508+O1508","v":0}]
[null,null,null,null,null,null,null,null,null,null,null,null,null,null,null,{"$f":"J1509+O1509","v":0}]
[null,null,null,null,null,null,null,null,null,null,null,null,null,null,null,{"$f":"J1510+O1510","v":0}]
[null,null,null,null,null,null,null,null,null,null,null,null,null,null,null,{"$f":"J1511+O1511","v":0}]
[null,null,null,null,null,null,null,null,null,null,null,null,null,null,null,{"$f":"J1512+O1512","v":0}]
[null,null,null,null,null,null,null,null,null,null,null,null,null,null,null,{"$f":"J1513+O1513","v":0}]
[null,null,null,null,null,null,null,null,null,null,null,null,null,null,null,{"$f":"J1514+O1514","v":0}]
[null,null,null,null,null,null,null,null,null,null,null,null,null,null,null,{"$f":"J1515+O1515","v":0}]
[null,null,null,null,null,null,null,null,null,null,null,null,null,null,null,{"$f":"J1516+O1516","v":0}]
[null,null,null,null,null,null,null,null,null,null,null,null,null,null,null,{"$f":"J1517+O1517","v":0}]
[null,null,null,null,null,null,null,null,null,null,null,null,null,null,null,{"$f":"J1518+O1518","v":0}]
[null,null,null,null,null,null,null,null,null,null,null,null,null,null,null,{"$f":"J1519+O1519","v":0}]
[null,null,null,null,null,null,null,null,null,null,null,null,null,null,null,{"$f":"J1520+O1520","v":0}]
[null,null,null,null,null,null,null,null,null,null,null,null,null,null,null,{"$f":"J1521+O1521","v":0}]
[null,null,null,null,null,null,null,null,null,null,null,null,null,null,null,{"$f":"J1522+O1522","v":0}]
[null,null,null,null,null,null,null,null,null,null,null,null,null,null,null,{"$f":"J1523+O1523","v":0}]
[null,null,null,null,null,null,null,null,null,null,null,null,null,null,null,{"$f":"J1524+O1524","v":0}]
[null,null,null,null,null,null,null,null,null,null,null,null,null,null,null,{"$f":"J1525+O1525","v":0}]
[null,null,null,null,null,null,null,null,null,null,null,null,null,null,null,{"$f":"J1526+O1526","v":0}]
[null,null,null,null,null,null,null,null,null,null,null,null,null,null,null,{"$f":"J1527+O1527","v":0}]
[null,null,null,null,null,null,null,null,null,null,null,null,null,null,null,{"$f":"J1528+O1528","v":0}]
[null,null,null,null,null,null,null,null,null,null,null,null,null,null,null,{"$f":"J1529+O1529","v":0}]
[null,null,null,null,null,null,null,null,null,null,null,null,null,null,null,{"$f":"J1530+O1530","v":0}]
[null,null,null,null,null,null,null,null,null,null,null,null,null,null,null,{"$f":"J1531+O1531","v":0}]
[null,null,null,null,null,null,null,null,null,null,null,null,null,null,null,{"$f":"J1532+O1532","v":0}]
[null,null,null,null,null,null,null,null,null,null,null,null,null,null,null,{"$f":"J1533+O1533","v":0}]
[null,null,null,null,null,null,null,null,null,null,null,null,null,null,null,{"$f":"J1534+O1534","v":0}]
[null,null,null,null,null,null,null,null,null,null,null,null,null,null,null,{"$f":"J1535+O1535","v":0}]
[null,null,null,null,null,null,null,null,null,null,null,null,null,null,null,{"$f":"J1536+O1536","v":0}]
[null,null,null,null,null,null,null,null,null,null,null,null,null,null,null,{"$f":"J1537+O1537","v":0}]
[null,null,null,null,null,null,null,null,null,null,null,null,null,null,null,{"$f":"J1538+O1538","v":0}]
[null,null,null,null,null,null,null,null,null,null,null,null,null,null,null,{"$f":"J1539+O1539","v":0}]
[null,null,null,null,null,null,null,null,null,null,null,null,null,null,null,{"$f":"J1540+O1540","v":0}]
[null,null,null,null,null,null,null,null,null,null,null,null,null,null,null,{"$f":"J1541+O1541","v":0}]
[null,null,null,null,null,null,null,null,null,null,null,null,null,null,null,{"$f":"J1542+O1542","v":0}]
[null,null,null,null,null,null,null,null,null,null,null,null,null,null,null,{"$f":"J1543+O1543","v":0}]
[null,null,null,null,null,null,null,null,null,null,null,null,null,null,null,{"$f":"J1544+O1544","v":0}]
[null,null,null,null,null,null,null,null,null,null,null,null,null,null,null,{"$f":"J1545+O1545","v":0}]
[null,null,null,null,null,null,null,null,null,null,null,null,null,null,null,{"$f":"J1546+O1546","v":0}]
[null,null,null,null,null,null,null,null,null,null,null,null,null,null,null,{"$f":"J1547+O1547","v":0}]
[null,null,null,null,null,null,null,null,null,null,null,null,null,null,null,{"$f":"J1548+O1548","v":0}]
[null,null,null,null,null,null,null,null,null,null,null,null,null,null,null,{"$f":"J1549+O1549","v":0}]
[null,null,null,null,null,null,null,null,null,null,null,null,null,null,null,{"$f":"J1550+O1550","v":0}]
[null,null,null,null,null,null,null,null,null,null,null,null,null,null,null,{"$f":"J1551+O1551","v":0}]
[null,null,null,null,null,null,null,null,null,null,null,null,null,null,null,{"$f":"J1552+O1552","v":0}]
[null,null,null,null,null,null,null,null,null,null,null,null,null,null,null,{"$f":"J1553+O1553","v":0}]
[null,null,null,null,null,null,null,null,null,null,null,null,null,null,null,{"$f":"J1554+O1554","v":0}]
[null,null,null,null,null,null,null,null,null,null,null,null,null,null,null,{"$f":"J1555+O1555","v":0}]
[null,null,null,null,null,null,null,null,null,null,null,null,null,null,null,{"$f":"J1556+O1556","v":0}]
[null,null,null,null,null,null,null,null,null,null,null,null,null,null,null,{"$f":"J1557+O1557","v":0}]
[null,null,null,null,null,null,null,null,null,null,null,null,null,null,null,{"$f":"J1558+O1558","v":0}]
[null,null,null,null,null,null,null,null,null,null,null,null,null,null,null,{"$f":"J1559+O1559","v":0}]
[null,null,null,null,null,null,null,null,null,null,null,null,null,null,null,{"$f":"J1560+O1560","v":0}]
[null,null,null,null,null,null,null,null,null,null,null,null,null,null,null,{"$f":"J1561+O1561","v":0}]
[null,null,null,null,null,null,null,null,null,null,null,null,null,null,null,{"$f":"J1562+O1562","v":0}]
[null,null,null,null,null,null,null,null,null,null,null,null,null,null,null,{"$f":"J1563+O1563","v":0}]
[null,null,null,null,null,null,null,null,null,null,null,null,null,null,null,{"$f":"J1564+O1564","v":0}]
[null,null,null,null,null,null,null,null,null,null,null,null,null,null,null,{"$f":"J1565+O1565","v":0}]
[null,null,null,null,null,null,null,null,null,null,null,null,null,null,null,{"$f":"J1566+O1566","v":0}]
[null,null,null,null,null,null,null,null,null,null,null,null,null,null,null,{"$f":"J1567+O1567","v":0}]
[null,null,null,null,null,null,null,null,null,null,null,null,null,null,null,{"$f":"J1568+O1568","v":0}]
[null,null,null,null,null,null,null,null,null,null,null,null,null,null,null,{"$f":"J1569+O1569","v":0}]
[null,null,null,null,null,null,null,null,null,null,null,null,null,null,null,{"$f":"J1570+O1570","v":0}]
[null,null,null,null,null,null,null,null,null,null,null,null,null,null,null,{"$f":"J1571+O1571","v":0}]
[null,null,null,null,null,null,null,null,null,null,null,null,null,null,null,{"$f":"J1572+O1572","v":0}]
[null,null,null,null,null,null,null,null,null,null,null,null,null,null,null,{"$f":"J1573+O1573","v":0}]
[null,null,null,null,null,null,null,null,null,null,null,null,null,null,null,{"$f":"J1574+O1574","v":0}]
[null,null,null,null,null,null,null,null,null,null,null,null,null,null,null,{"$f":"J1575+O1575","v":0}]
[null,null,null,null,null,null,null,null,null,null,null,null,null,null,null,{"$f":"J1576+O1576","v":0}]
[null,null,null,null,null,null,null,null,null,null,null,null,null,null,null,{"$f":"J1577+O1577","v":0}]
[null,null,null,null,null,null,null,null,null,null,null,null,null,null,null,{"$f":"J1578+O1578","v":0}]
[null,null,null,null,null,null,null,null,null,null,null,null,null,null,null,{"$f":"J1579+O1579","v":0}]
[null,null,null,null,null,null,null,null,null,null,null,null,null,null,null,{"$f":"J1580+O1580","v":0}]
[null,null,null,null,null,null,null,null,null,null,null,null,null,null,null,{"$f":"J1581+O1581","v":0}]
[null,null,null,null,null,null,null,null,null,null,null,null,null,null,null,{"$f":"J1582+O1582","v":0}]
[null,null,null,null,null,null,null,null,null,null,null,null,null,null,null,{"$f":"J1583+O1583","v":0}]
[null,null,null,null,null,null,null,null,null,null,null,null,null,null,null,{"$f":"J1584+O1584","v":0}]
[null,null,null,null,null,null,null,null,null,null,null,null,null,null,null,{"$f":"J1585+O1585","v":0}]
[null,null,null,null,null,null,null,null,null,null,null,null,null,null,null,{"$f":"J1586+O1586","v":0}]
[null,null,null,null,null,null,null,null,null,null,null,null,null,null,null,{"$f":"J1587+O1587","v":0}]
[null,null,null,null,null,null,null,null,null,null,null,null,null,null,null,{"$f":"J1588+O1588","v":0}]
[null,null,null,null,null,null,null,null,null,null,null,null,null,null,null,{"$f":"J1589+O1589","v":0}]
[null,null,null,null,null,null,null,null,null,null,null,null,null,null,null,{"$f":"J1590+O1590","v":0}]
[null,null,null,null,null,null,null,null,null,null,null,null,null,null,null,{"$f":"J1591+O1591","v":0}]
[null,null,null,null,null,null,null,null,null,null,null,null,null,null,null,{"$f":"J1592+O1592","v":0}]
[null,null,null,null,null,null,null,null,null,null,null,null,null,null,null,{"$f":"J1593+O1593","v":0}]
[null,null,null,null,null,null,null,null,null,null,null,null,null,null,null,{"$f":"J1594+O1594","v":0}]
[null,null,null,null,null,null,null,null,null,null,null,null,null,null,null,{"$f":"J1595+O1595","v":0}]
[null,null,null,null,null,null,null,null,null,null,null,null,null,null,null,{"$f":"J1596+O1596","v":0}]
[null,null,null,null,null,null,null,null,null,null,null,null,null,null,null,{"$f":"J1597+O1597","v":0}]
[null,null,null,null,null,null,null,null,null,null,null,null,null,null,null,{"$f":"J1598+O1598","v":0}]
[null,null,null,null,null,null,null,null,null,null,null,null,null,null,null,{"$f":"J1599+O1599","v":0}]
[null,null,null,null,null,null,null,null,null,null,null,null,null,null,null,{"$f":"J1600+O1600","v":0}]
[null,null,null,null,null,null,null,null,null,null,null,null,null,null,null,{"$f":"J1601+O1601","v":0}]
[null,null,null,null,null,null,null,null,null,null,null,null,null,null,null,{"$f":"J1602+O1602","v":0}]
[null,null,null,null,null,null,null,null,null,null,null,null,null,null,null,{"$f":"J1603+O1603","v":0}]
[null,null,null,null,null,null,null,null,null,null,null,null,null,null,null,{"$f":"J1604+O1604","v":0}]
[null,null,null,null,null,null,null,null,null,null,null,null,null,null,null,{"$f":"J1605+O1605","v":0}]
[null,null,null,null,null,null,null,null,null,null,null,null,null,null,null,{"$f":"J1606+O1606","v":0}]
[null,null,null,null,null,null,null,null,null,null,null,null,null,null,null,{"$f":"J1607+O1607","v":0}]
[null,null,null,null,null,null,null,null,null,null,null,null,null,null,null,{"$f":"J1608+O1608","v":0}]
[null,null,null,null,null,null,null,null,null,null,null,null,null,null,null,{"$f":"J1609+O1609","v":0}]
[null,null,null,null,null,null,null,null,null,null,null,null,null,null,null,{"$f":"J1610+O1610","v":0}]
[null,null,null,null,null,null,null,null,null,null,null,null,null,null,null,{"$f":"J1611+O1611","v":0}]
[null,null,null,null,null,null,null,null,null,null,null,null,null,null,null,{"$f":"J1612+O1612","v":0}]
[null,null,null,null,null,null,null,null,null,null,null,null,null,null,null,{"$f":"J1613+O1613","v":0}]
[null,null,null,null,null,null,null,null,null,null,null,null,null,null,null,{"$f":"J1614+O1614","v":0}]
[null,null,null,null,null,null,null,null,null,null,null,null,null,null,null,{"$f":"J1615+O1615","v":0}]
[null,null,null,null,null,null,null,null,null,null,null,null,null,null,null,{"$f":"J1616+O1616","v":0}]
[null,null,null,null,null,null,null,null,null,null,null,null,null,null,null,{"$f":"J1617+O1617","v":0}]
[null,null,null,null,null,null,null,null,null,null,null,null,null,null,null,{"$f":"J1618+O1618","v":0}]
[null,null,null,null,null,null,null,null,null,null,null,null,null,null,null,{"$f":"J1619+O1619","v":0}]
[null,null,null,null,null,null,null,null,null,null,null,null,null,null,null,{"$f":"J1620+O1620","v":0}]
[null,null,null,null,null,null,null,null,null,null,null,null,null,null,null,{"$f":"J1621+O1621","v":0}]
[null,null,null,null,null,null,null,null,null,null,null,null,null,null,null,{"$f":"J1622+O1622","v":0}]
[null,null,null,null,null,null,null,null,null,null,null,null,null,null,null,{"$f":"J1623+O1623","v":0}]
[null,null,null,null,null,null,null,null,null,null,null,null,null,null,null,{"$f":"J1624+O1624","v":0}]
[null,null,null,null,null,null,null,null,null,null,null,null,null,null,null,{"$f":"J1625+O1625","v":0}]
[null,null,null,null,null,null,null,null,null,null,null,null,null,null,null,{"$f":"J1626+O1626","v":0}]
[null,null,null,null,null,null,null,null,null,null,null,null,null,null,null,{"$f":"J1627+O1627","v":0}]
[null,null,null,null,null,null,null,null,null,null,null,null,null,null,null,{"$f":"J1628+O1628","v":0}]
[null,null,null,null,null,null,null,null,null,null,null,null,null,null,null,{"$f":"J1629+O1629","v":0}]
[null,null,null,null,null,null,null,null,null,null,null,null,null,null,null,{"$f":"J1630+O1630","v":0}]
[null,null,null,null,null,null,null,null,null,null,null,null,null,null,null,{"$f":"J1631+O1631","v":0}]
[null,null,null,null,null,null,null,null,null,null,null,null,null,null,null,{"$f":"J1632+O1632","v":0}]
[null,null,null,null,null,null,null,null,null,null,null,null,null,null,null,{"$f":"J1633+O1633","v":0}]
[null,null,null,null,null,null,null,null,null,null,null,null,null,null,null,{"$f":"J1634+O1634","v":0}]
[null,null,null,null,null,null,null,null,null,null,null,null,null,null,null,{"$f":"J1635+O1635","v":0}]
[null,null,null,null,null,null,null,null,null,null,null,null,null,null,null,{"$f":"J1636+O1636","v":0}]
[null,null,null,null,null,null,null,null,null,null,null,null,null,null,null,{"$f":"J1637+O1637","v":0}]
[null,null,null,null,null,null,null,null,null,null,null,null,null,null,null,{"$f":"J1638+O1638","v":0}]
[null,null,null,null,null,null,null,null,null,null,null,null,null,null,null,{"$f":"J1639+O1639","v":0}]
[null,null,null,null,null,null,null,null,null,null,null,null,null,null,null,{"$f":"J1640+O1640","v":0}]
[null,null,null,null,null,null,null,null,null,null,null,null,null,null,null,{"$f":"J1641+O1641","v":0}]
[null,null,null,null,null,null,null,null,null,null,null,null,null,null,null,{"$f":"J1642+O1642","v":0}]
[null,null,null,null,null,null,null,null,null,null,null,null,null,null,null,{"$f":"J1643+O1643","v":0}]
[null,null,null,null,null,null,null,null,null,null,null,null,null,null,null,{"$f":"J1644+O1644","v":0}]
[null,null,null,null,null,null,null,null,null,null,null,null,null,null,null,{"$f":"J1645+O1645","v":0}]
[null,null,null,null,null,null,null,null,null,null,null,null,null,null,null,{"$f":"J1646+O1646","v":0}]
[null,null,null,null,null,null,null,null,null,null,null,null,null,null,null,{"$f":"J1647+O1647","v":0}]
[null,null,null,null,null,null,null,null,null,null,null,null,null,null,null,{"$f":"J1648+O1648","v":0}]
[null,null,null,null,null,null,null,null,null,null,null,null,null,null,null,{"$f":"J1649+O1649","v":0}]
[null,null,null,null,null,null,null,null,null,null,null,null,null,null,null,{"$f":"J1650+O1650","v":0}]
[null,null,null,null,null,null,null,null,null,null,null,null,null,null,null,{"$f":"J1651+O1651","v":0}]
[null,null,null,null,null,null,null,null,null,null,null,null,null,null,null,{"$f":"J1652+O1652","v":0}]
[null,null,null,null,null,null,null,null,null,null,null,null,null,null,null,{"$f":"J1653+O1653","v":0}]
[null,null,null,null,null,null,null,null,null,null,null,null,null,null,null,{"$f":"J1654+O1654","v":0}]
[null,null,null,null,null,null,null,null,null,null,null,null,null,null,null,{"$f":"J1655+O1655","v":0}]
[null,null,null,null,null,null,null,null,null,null,null,null,null,null,null,{"$f":"J1656+O1656","v":0}]
[null,null,null,null,null,null,null,null,null,null,null,null,null,null,null,{"$f":"J1657+O1657","v":0}]
[null,null,null,null,null,null,null,null,null,null,null,null,null,null,null,{"$f":"J1658+O1658","v":0}]
[null,null,null,null,null,null,null,null,null,null,null,null,null,null,null,{"$f":"J1659+O1659","v":0}]
[null,null,null,null,null,null,null,null,null,null,null,null,null,null,null,{"$f":"J1660+O1660","v":0}]
[null,null,null,null,null,null,null,null,null,null,null,null,null,null,null,{"$f":"J1661+O1661","v":0}]
[null,null,null,null,null,null,null,null,null,null,null,null,null,null,null,{"$f":"J1662+O1662","v":0}]
[null,null,null,null,null,null,null,null,null,null,null,null,null,null,null,{"$f":"J1663+O1663","v":0}]
[null,null,null,null,null,null,null,null,null,null,null,null,null,null,null,{"$f":"J1664+O1664","v":0}]
[null,null,null,null,null,null,null,null,null,null,null,null,null,null,null,{"$f":"J1665+O1665","v":0}]
[null,null,null,null,null,null,null,null,null,null,null,null,null,null,null,{"$f":"J1666+O1666","v":0}]
[null,null,null,null,null,null,null,null,null,null,null,null,null,null,null,{"$f":"J1667+O1667","v":0}]
[null,null,null,null,null,null,null,null,null,null,null,null,null,null,null,{"$f":"J1668+O1668","v":0}]
[null,null,null,null,null,null,null,null,null,null,null,null,null,null,null,{"$f":"J1669+O1669","v":0}]
[null,null,null,null,null,null,null,null,null,null,null,null,null,null,null,{"$f":"J1670+O1670","v":0}]
[null,null,null,null,null,null,null,null,null,null,null,null,null,null,null,{"$f":"J1671+O1671","v":0}]
[null,null,null,null,null,null,null,null,null,null,null,null,null,null,null,{"$f":"J1672+O1672","v":0}]
[null,null,null,null,null,null,null,null,null,null,null,null,null,null,null,{"$f":"J1673+O1673","v":0}]
[null,null,null,null,null,null,null,null,null,null,null,null,null,null,null,{"$f":"J1674+O1674","v":0}]
[null,null,null,null,null,null,null,null,null,null,null,null,null,null,null,{"$f":"J1675+O1675","v":0}]
[null,null,null,null,null,null,null,null,null,null,null,null,null,null,null,{"$f":"J1676+O1676","v":0}]
[null,null,null,null,null,null,null,null,null,null,null,null,null,null,null,{"$f":"J1677+O1677","v":0}]
[null,null,null,null,null,null,null,null,null,null,null,null,null,null,null,{"$f":"J1678+O1678","v":0}]
[null,null,null,null,null,null,null,null,null,null,null,null,null,null,null,{"$f":"J1679+O1679","v":0}]
[null,null,null,null,null,null,null,null,null,null,null,null,null,null,null,{"$f":"J1680+O1680","v":0}]
[null,null,null,null,null,null,null,null,null,null,null,null,null,null,null,{"$f":"J1681+O1681","v":0}]
[null,null,null,null,null,null,null,null,null,null,null,null,null,null,null,{"$f":"J1682+O1682","v":0}]
[null,null,null,null,null,null,null,null,null,null,null,null,null,null,null,{"$f":"J1683+O1683","v":0}]
[null,null,null,null,null,null,null,null,null,null,null,null,null,null,null,{"$f":"J1684+O1684","v":0}]
[null,null,null,null,null,null,null,null,null,null,null,null,null,null,null,{"$f":"J1685+O1685","v":0}]
[null,null,null,null,null,null,null,null,null,null,null,null,null,null,null,{"$f":"J1686+O1686","v":0}]
[null,null,null,null,null,null,null,null,null,null,null,null,null,null,null,{"$f":"J1687+O1687","v":0}]
[null,null,null,null,null,null,null,null,null,null,null,null,null,null,null,{"$f":"J1688+O1688","v":0}]
[null,null,null,null,null,null,null,null,null,null,null,null,null,null,null,{"$f":"J1689+O1689","v":0}]
[null,null,null,null,null,null,null,null,null,null,null,null,null,null,null,{"$f":"J1690+O1690","v":0}]
[null,null,null,null,null,null,null,null,null,null,null,null,null,null,null,{"$f":"J1691+O1691","v":0}]
[null,null,null,null,null,null,null,null,null,null,null,null,null,null,null,{"$f":"J1692+O1692","v":0}]
[null,null,null,null,null,null,null,null,null,null,null,null,null,null,null,{"$f":"J1693+O1693","v":0}]
[null,null,null,null,null,null,null,null,null,null,null,null,null,null,null,{"$f":"J1694+O1694","v":0}]
[null,null,null,null,null,null,null,null,null,null,null,null,null,null,null,{"$f":"J1695+O1695","v":0}]
[null,null,null,null,null,null,null,null,null,null,null,null,null,null,null,{"$f":"J1696+O1696","v":0}]
[null,null,null,null,null,null,null,null,null,null,null,null,null,null,null,{"$f":"J1697+O1697","v":0}]
[null,null,null,null,null,null,null,null,null,null,null,null,null,null,null,{"$f":"J1698+O1698","v":0}]
[null,null,null,null,null,null,null,null,null,null,null,null,null,null,null,{"$f":"J1699+O1699","v":0}]
[null,null,null,null,null,null,null,null,null,null,null,null,null,null,null,{"$f":"J1700+O1700","v":0}]
[null,null,null,null,null,null,null,null,null,null,null,null,null,null,null,{"$f":"J1701+O1701","v":0}]
[null,null,null,null,null,null,null,null,null,null,null,null,null,null,null,{"$f":"J1702+O1702","v":0}]
[null,null,null,null,null,null,null,null,null,null,null,null,null,null,null,{"$f":"J1703+O1703","v":0}]
[null,null,null,null,null,null,null,null,null,null,null,null,null,null,null,{"$f":"J1704+O1704","v":0}]
[null,null,null,null,null,null,null,null,null,null,null,null,null,null,null,{"$f":"J1705+O1705","v":0}]
[null,null,null,null,null,null,null,null,null,null,null,null,null,null,null,{"$f":"J1706+O1706","v":0}]
[null,null,null,null,null,null,null,null,null,null,null,null,null,null,null,{"$f":"J1707+O1707","v":0}]
[null,null,null,null,null,null,null,null,null,null,null,null,null,null,null,{"$f":"J1708+O1708","v":0}]
[null,null,null,null,null,null,null,null,null,null,null,null,null,null,null,{"$f":"J1709+O1709","v":0}]
[null,null,null,null,null,null,null,null,null,null,null,null,null,null,null,{"$f":"J1710+O1710","v":0}]
[null,null,null,null,null,null,null,null,null,null,null,null,null,null,null,{"$f":"J1711+O1711","v":0}]
[null,null,null,null,null,null,null,null,null,null,null,null,null,null,null,{"$f":"J1712+O1712","v":0}]
[null,null,null,null,null,null,null,null,null,null,null,null,null,null,null,{"$f":"J1713+O1713","v":0}]
[null,null,null,null,null,null,null,null,null,null,null,null,null,null,null,{"$f":"J1714+O1714","v":0}]
[null,null,null,null,null,null,null,null,null,null,null,null,null,null,null,{"$f":"J1715+O1715","v":0}]
[null,null,null,null,null,null,null,null,null,null,null,null,null,null,null,{"$f":"J1716+O1716","v":0}]
[null,null,null,null,null,null,null,null,null,null,null,null,null,null,null,{"$f":"J1717+O1717","v":0}]
[null,null,null,null,null,null,null,null,null,null,null,null,null,null,null,{"$f":"J1718+O1718","v":0}]
[null,null,null,null,null,null,null,null,null,null,null,null,null,null,null,{"$f":"J1719+O1719","v":0}]
[null,null,null,null,null,null,null,null,null,null,null,null,null,null,null,{"$f":"J1720+O1720","v":0}]
[null,null,null,null,null,null,null,null,null,null,null,null,null,null,null,{"$f":"J1721+O1721","v":0}]
[null,null,null,null,null,null,null,null,null,null,null,null,null,null,null,{"$f":"J1722+O1722","v":0}]
[null,null,null,null,null,null,null,null,null,null,null,null,null,null,null,{"$f":"J1723+O1723","v":0}]
[null,null,null,null,null,null,null,null,null,null,null,null,null,null,null,{"$f":"J1724+O1724","v":0}]
[null,null,null,null,null,null,null,null,null,null,null,null,null,null,null,{"$f":"J1725+O1725","v":0}]
[null,null,null,null,null,null,null,null,null,null,null,null,null,null,null,{"$f":"J1726+O1726","v":0}]
[null,null,null,null,null,null,null,null,null,null,null,null,null,null,null,{"$f":"J1727+O1727","v":0}]
[null,null,null,null,null,null,null,null,null,null,null,null,null,null,null,{"$f":"J1728+O1728","v":0}]
[null,null,null,null,null,null,null,null,null,null,null,null,null,null,null,{"$f":"J1729+O1729","v":0}]
[null,null,null,null,null,null,null,null,null,null,null,null,null,null,null,{"$f":"J1730+O1730","v":0}]
[null,null,null,null,null,null,null,null,null,null,null,null,null,null,null,{"$f":"J1731+O1731","v":0}]
[null,null,null,null,null,null,null,null,null,null,null,null,null,null,null,{"$f":"J1732+O1732","v":0}]
[null,null,null,null,null,null,null,null,null,null,null,null,null,null,null,{"$f":"J1733+O1733","v":0}]
[null,null,null,null,null,null,null,null,null,null,null,null,null,null,null,{"$f":"J1734+O1734","v":0}]
[null,null,null,null,null,null,null,null,null,null,null,null,null,null,null,{"$f":"J1735+O1735","v":0}]
[null,null,null,null,null,null,null,null,null,null,null,null,null,null,null,{"$f":"J1736+O1736","v":0}]
[null,null,null,null,null,null,null,null,null,null,null,null,null,null,null,{"$f":"J1737+O1737","v":0}]
[null,null,null,null,null,null,null,null,null,null,null,null,null,null,null,{"$f":"J1738+O1738","v":0}]
[null,null,null,null,null,null,null,null,null,null,null,null,null,null,null,{"$f":"J1739+O1739","v":0}]
[null,null,null,null,null,null,null,null,null,null,null,null,null,null,null,{"$f":"J1740+O1740","v":0}]
[null,null,null,null,null,null,null,null,null,null,null,null,null,null,null,{"$f":"J1741+O1741","v":0}]
[null,null,null,null,null,null,null,null,null,null,null,null,null,null,null,{"$f":"J1742+O1742","v":0}]
[null,null,null,null,null,null,null,null,null,null,null,null,null,null,null,{"$f":"J1743+O1743","v":0}]
[null,null,null,null,null,null,null,null,null,null,null,null,null,null,null,{"$f":"J1744+O1744","v":0}]
[null,null,null,null,null,null,null,null,null,null,null,null,null,null,null,{"$f":"J1745+O1745","v":0}]
[null,null,null,null,null,null,null,null,null,null,null,null,null,null,null,{"$f":"J1746+O1746","v":0}]
[null,null,null,null,null,null,null,null,null,null,null,null,null,null,null,{"$f":"J1747+O1747","v":0}]
[null,null,null,null,null,null,null,null,null,null,null,null,null,null,null,{"$f":"J1748+O1748","v":0}]
[null,null,null,null,null,null,null,null,null,null,null,null,null,null,null,{"$f":"J1749+O1749","v":0}]
[null,null,null,null,null,null,null,null,null,null,null,null,null,null,null,{"$f":"J1750+O1750","v":0}]
[null,null,null,null,null,null,null,null,null,null,null,null,null,null,null,{"$f":"J1751+O1751","v":0}]
[null,null,null,null,null,null,null,null,null,null,null,null,null,null,null,{"$f":"J1752+O1752","v":0}]
[null,null,null,null,null,null,null,null,null,null,null,null,null,null,null,{"$f":"J1753+O1753","v":0}]
[null,null,null,null,null,null,null,null,null,null,null,null,null,null,null,{"$f":"J1754+O1754","v":0}]
[null,null,null,null,null,null,null,null,null,null,null,null,null,null,null,{"$f":"J1755+O1755","v":0}]
[null,null,null,null,null,null,null,null,null,null,null,null,null,null,null,{"$f":"J1756+O1756","v":0}]
[null,null,null,null,null,null,null,null,null,null,null,null,null,null,null,{"$f":"J1757+O1757","v":0}]
[null,null,null,null,null,null,null,null,null,null,null,null,null,null,null,{"$f":"J1758+O1758","v":0}]
[null,null,null,null,null,null,null,null,null,null,null,null,null,null,null,{"$f":"J1759+O1759","v":0}]
[null,null,null,null,null,null,null,null,null,null,null,null,null,null,null,{"$f":"J1760+O1760","v":0}]
[null,null,null,null,null,null,null,null,null,null,null,null,null,null,null,{"$f":"J1761+O1761","v":0}]
[null,null,null,null,null,null,null,null,null,null,null,null,null,null,null,{"$f":"J1762+O1762","v":0}]
[null,null,null,null,null,null,null,null,null,null,null,null,null,null,null,{"$f":"J1763+O1763","v":0}]
[null,null,null,null,null,null,null,null,null,null,null,null,null,null,null,{"$f":"J1764+O1764","v":0}]
[null,null,null,null,null,null,null,null,null,null,null,null,null,null,null,{"$f":"J1765+O1765","v":0}]
[null,null,null,null,null,null,null,null,null,null,null,null,null,null,null,{"$f":"J1766+O1766","v":0}]
[null,null,null,null,null,null,null,null,null,null,null,null,null,null,null,{"$f":"J1767+O1767","v":0}]
[null,null,null,null,null,null,null,null,null,null,null,null,null,null,null,{"$f":"J1768+O1768","v":0}]
[null,null,null,null,null,null,null,null,null,null,null,null,null,null,null,{"$f":"J1769+O1769","v":0}]
[null,null,null,null,null,null,null,null,null,null,null,null,null,null,null,{"$f":"J1770+O1770","v":0}]
[null,null,null,null,null,null,null,null,null,null,null,null,null,null,null,{"$f":"J1771+O1771","v":0}]
[null,null,null,null,null,null,null,null,null,null,null,null,null,null,null,{"$f":"J1772+O1772","v":0}]
[null,null,null,null,null,null,null,null,null,null,null,null,null,null,null,{"$f":"J1773+O1773","v":0}]
[null,null,null,null,null,null,null,null,null,null,null,null,null,null,null,{"$f":"J1774+O1774","v":0}]
[null,null,null,null,null,null,null,null,null,null,null,null,null,null,null,{"$f":"J1775+O1775","v":0}]
[null,null,null,null,null,null,null,null,null,null,null,null,null,null,null,{"$f":"J1776+O1776","v":0}]
[null,null,null,null,null,null,null,null,null,null,null,null,null,null,null,{"$f":"J1777+O1777","v":0}]
[null,null,null,null,null,null,null,null,null,null,null,null,null,null,null,{"$f":"J1778+O1778","v":0}]
[null,null,null,null,null,null,null,null,null,null,null,null,null,null,null,{"$f":"J1779+O1779","v":0}]
[null,null,null,null,null,null,null,null,null,null,null,null,null,null,null,{"$f":"J1780+O1780","v":0}]
[null,null,null,null,null,null,null,null,null,null,null,null,null,null,null,{"$f":"J1781+O1781","v":0}]
[null,null,null,null,null,null,null,null,null,null,null,null,null,null,null,{"$f":"J1782+O1782","v":0}]
[null,null,null,null,null,null,null,null,null,null,null,null,null,null,null,{"$f":"J1783+O1783","v":0}]
[null,null,null,null,null,null,null,null,null,null,null,null,null,null,null,{"$f":"J1784+O1784","v":0}]
[null,null,null,null,null,null,null,null,null,null,null,null,null,null,null,{"$f":"J1785+O1785","v":0}]
[null,null,null,null,null,null,null,null,null,null,null,null,null,null,null,{"$f":"J1786+O1786","v":0}]
[null,null,null,null,null,null,null,null,null,null,null,null,null,null,null,{"$f":"J1787+O1787","v":0}]
[null,null,null,null,null,null,null,null,null,null,null,null,null,null,null,{"$f":"J1788+O1788","v":0}]
[null,null,null,null,null,null,null,null,null,null,null,null,null,null,null,{"$f":"J1789+O1789","v":0}]
[null,null,null,null,null,null,null,null,null,null,null,null,null,null,null,{"$f":"J1790+O1790","v":0}]
[null,null,null,null,null,null,null,null,null,null,null,null,null,null,null,{"$f":"J1791+O1791","v":0}]
[null,null,null,null,null,null,null,null,null,null,null,null,null,null,null,{"$f":"J1792+O1792","v":0}]
[null,null,null,null,null,null,null,null,null,null,null,null,null,null,null,{"$f":"J1793+O1793","v":0}]
[null,null,null,null,null,null,null,null,null,null,null,null,null,null,null,{"$f":"J1794+O1794","v":0}]
[null,null,null,null,null,null,null,null,null,null,null,null,null,null,null,{"$f":"J1795+O1795","v":0}]
[null,null,null,null,null,null,null,null,null,null,null,null,null,null,null,{"$f":"J1796+O1796","v":0}]
[null,null,null,null,null,null,null,null,null,null,null,null,null,null,null,{"$f":"J1797+O1797","v":0}]
[null,null,null,null,null,null,null,null,null,null,null,null,null,null,null,{"$f":"J1798+O1798","v":0}]
[null,null,null,null,null,null,null,null,null,null,null,null,null,null,null,{"$f":"J1799+O1799","v":0}]
[null,null,null,null,null,null,null,null,null,null,null,null,null,null,null,{"$f":"J1800+O1800","v":0}]
[null,null,null,null,null,null,null,null,null,null,null,null,null,null,null,{"$f":"J1801+O1801","v":0}]
[null,null,null,null,null,null,null,null,null,null,null,null,null,null,null,{"$f":"J1802+O1802","v":0}]
[null,null,null,null,null,null,null,null,null,null,null,null,null,null,null,{"$f":"J1803+O1803","v":0}]
[null,null,null,null,null,null,null,null,null,null,null,null,null,null,null,{"$f":"J1804+O1804","v":0}]
[null,null,null,null,null,null,null,null,null,null,null,null,null,null,null,{"$f":"J1805+O1805","v":0}]
[null,null,null,null,null,null,null,null,null,null,null,null,null,null,null,{"$f":"J1806+O1806","v":0}]
[null,null,null,null,null,null,null,null,null,null,null,null,null,null,null,{"$f":"J1807+O1807","v":0}]
[null,null,null,null,null,null,null,null,null,null,null,null,null,null,null,{"$f":"J1808+O1808","v":0}]
[null,null,null,null,null,null,null,null,null,null,null,null,null,null,null,{"$f":"J1809+O1809","v":0}]
[null,null,null,null,null,null,null,null,null,null,null,null,null,null,null,{"$f":"J1810+O1810","v":0}]
[null,null,null,null,null,null,null,null,null,null,null,null,null,null,null,{"$f":"J1811+O1811","v":0}]
[null,null,null,null,null,null,null,null,null,null,null,null,null,null,null,{"$f":"J1812+O1812","v":0}]
[null,null,null,null,null,null,null,null,null,null,null,null,null,null,null,{"$f":"J1813+O1813","v":0}]
[null,null,null,null,null,null,null,null,null,null,null,null,null,null,null,{"$f":"J1814+O1814","v":0}]
[null,null,null,null,null,null,null,null,null,null,null,null,null,null,null,{"$f":"J1815+O1815","v":0}]
[null,null,null,null,null,null,null,null,null,null,null,null,null,null,null,{"$f":"J1816+O1816","v":0}]
[null,null,null,null,null,null,null,null,null,null,null,null,null,null,null,{"$f":"J1817+O1817","v":0}]
[null,null,null,null,null,null,null,null,null,null,null,null,null,null,null,{"$f":"J1818+O1818","v":0}]
[null,null,null,null,null,null,null,null,null,null,null,null,null,null,null,{"$f":"J1819+O1819","v":0}]
[null,null,null,null,null,null,null,null,null,null,null,null,null,null,null,{"$f":"J1820+O1820","v":0}]
[null,null,null,null,null,null,null,null,null,null,null,null,null,null,null,{"$f":"J1821+O1821","v":0}]
[null,null,null,null,null,null,null,null,null,null,null,null,null,null,null,{"$f":"J1822+O1822","v":0}]
[null,null,null,null,null,null,null,null,null,null,null,null,null,null,null,{"$f":"J1823+O1823","v":0}]
[null,null,null,null,null,null,null,null,null,null,null,null,null,null,null,{"$f":"J1824+O1824","v":0}]
[null,null,null,null,null,null,null,null,null,null,null,null,null,null,null,{"$f":"J1825+O1825","v":0}]
[null,null,null,null,null,null,null,null,null,null,null,null,null,null,null,{"$f":"J1826+O1826","v":0}]
[null,null,null,null,null,null,null,null,null,null,null,null,null,null,null,{"$f":"J1827+O1827","v":0}]
[null,null,null,null,null,null,null,null,null,null,null,null,null,null,null,{"$f":"J1828+O1828","v":0}]
[null,null,null,null,null,null,null,null,null,null,null,null,null,null,null,{"$f":"J1829+O1829","v":0}]
[null,null,null,null,null,null,null,null,null,null,null,null,null,null,null,{"$f":"J1830+O1830","v":0}]
[null,null,null,null,null,null,null,null,null,null,null,null,null,null,null,{"$f":"J1831+O1831","v":0}]
[null,null,null,null,null,null,null,null,null,null,null,null,null,null,null,{"$f":"J1832+O1832","v":0}]
[null,null,null,null,null,null,null,null,null,null,null,null,null,null,null,{"$f":"J1833+O1833","v":0}]
[null,null,null,null,null,null,null,null,null,null,null,null,null,null,null,{"$f":"J1834+O1834","v":0}]
[null,null,null,null,null,null,null,null,null,null,null,null,null,null,null,{"$f":"J1835+O1835","v":0}]
[null,null,null,null,null,null,null,null,null,null,null,null,null,null,null,{"$f":"J1836+O1836","v":0}]
[null,null,null,null,null,null,null,null,null,null,null,null,null,null,null,{"$f":"J1837+O1837","v":0}]
[null,null,null,null,null,null,null,null,null,null,null,null,null,null,null,{"$f":"J1838+O1838","v":0}]
[null,null,null,null,null,null,null,null,null,null,null,null,null,null,null,{"$f":"J1839+O1839","v":0}]
[null,null,null,null,null,null,null,null,null,null,null,null,null,null,null,{"$f":"J1840+O1840","v":0}]
[null,null,null,null,null,null,null,null,null,null,null,null,null,null,null,{"$f":"J1841+O1841","v":0}]
[null,null,null,null,null,null,null,null,null,null,null,null,null,null,null,{"$f":"J1842+O1842","v":0}]
[null,null,null,null,null,null,null,null,null,null,null,null,null,null,null,{"$f":"J1843+O1843","v":0}]
[null,null,null,null,null,null,null,null,null,null,null,null,null,null,null,{"$f":"J1844+O1844","v":0}]
[null,null,null,null,null,null,null,null,null,null,null,null,null,null,null,{"$f":"J1845+O1845","v":0}]
[null,null,null,null,null,null,null,null,null,null,null,null,null,null,null,{"$f":"J1846+O1846","v":0}]
[null,null,null,null,null,null,null,null,null,null,null,null,null,null,null,{"$f":"J1847+O1847","v":0}]
[null,null,null,null,null,null,null,null,null,null,null,null,null,null,null,{"$f":"J1848+O1848","v":0}]
[null,null,null,null,null,null,null,null,null,null,null,null,null,null,null,{"$f":"J1849+O1849","v":0}]
[null,null,null,null,null,null,null,null,null,null,null,null,null,null,null,{"$f":"J1850+O1850","v":0}]
[null,null,null,null,null,null,null,null,null,null,null,null,null,null,null,{"$f":"J1851+O1851","v":0}]
[null,null,null,null,null,null,null,null,null,null,null,null,null,null,null,{"$f":"J1852+O1852","v":0}]
[null,null,null,null,null,null,null,null,null,null,null,null,null,null,null,{"$f":"J1853+O1853","v":0}]
[null,null,null,null,null,null,null,null,null,null,null,null,null,null,null,{"$f":"J1854+O1854","v":0}]
[null,null,null,null,null,null,null,null,null,null,null,null,null,null,null,{"$f":"J1855+O1855","v":0}]
[null,null,null,null,null,null,null,null,null,null,null,null,null,null,null,{"$f":"J1856+O1856","v":0}]
[null,null,null,null,null,null,null,null,null,null,null,null,null,null,null,{"$f":"J1857+O1857","v":0}]
[null,null,null,null,null,null,null,null,null,null,null,null,null,null,null,{"$f":"J1858+O1858","v":0}]
[null,null,null,null,null,null,null,null,null,null,null,null,null,null,null,{"$f":"J1859+O1859","v":0}]
[null,null,null,null,null,null,null,null,null,null,null,null,null,null,null,{"$f":"J1860+O1860","v":0}]
[null,null,null,null,null,null,null,null,null,null,null,null,null,null,null,{"$f":"J1861+O1861","v":0}]
[null,null,null,null,null,null,null,null,null,null,null,null,null,null,null,{"$f":"J1862+O1862","v":0}]
[null,null,null,null,null,null,null,null,null,null,null,null,null,null,null,{"$f":"J1863+O1863","v":0}]
[null,null,null,null,null,null,null,null,null,null,null,null,null,null,null,{"$f":"J1864+O1864","v":0}]
[null,null,null,null,null,null,null,null,null,null,null,null,null,null,null,{"$f":"J1865+O1865","v":0}]
[null,null,null,null,null,null,null,null,null,null,null,null,null,null,null,{"$f":"J1866+O1866","v":0}]
[null,null,null,null,null,null,null,null,null,null,null,null,null,null,null,{"$f":"J1867+O1867","v":0}]
[null,null,null,null,null,null,null,null,null,null,null,null,null,null,null,{"$f":"J1868+O1868","v":0}]
[null,null,null,null,null,null,null,null,null,null,null,null,null,null,null,{"$f":"J1869+O1869","v":0}]
[null,null,null,null,null,null,null,null,null,null,null,null,null,null,null,{"$f":"J1870+O1870","v":0}]
[null,null,null,null,null,null,null,null,null,null,null,null,null,null,null,{"$f":"J1871+O1871","v":0}]
[null,null,null,null,null,null,null,null,null,null,null,null,null,null,null,{"$f":"J1872+O1872","v":0}]
[null,null,null,null,null,null,null,null,null,null,null,null,null,null,null,{"$f":"J1873+O1873","v":0}]
[null,null,null,null,null,null,null,null,null,null,null,null,null,null,null,{"$f":"J1874+O1874","v":0}]
[null,null,null,null,null,null,null,null,null,null,null,null,null,null,null,{"$f":"J1875+O1875","v":0}]
[null,null,null,null,null,null,null,null,null,null,null,null,null,null,null,{"$f":"J1876+O1876","v":0}]
[null,null,null,null,null,null,null,null,null,null,null,null,null,null,null,{"$f":"J1877+O1877","v":0}]
[null,null,null,null,null,null,null,null,null,null,null,null,null,null,null,{"$f":"J1878+O1878","v":0}]
[null,null,null,null,null,null,null,null,null,null,null,null,null,null,null,{"$f":"J1879+O1879","v":0}]
[null,null,null,null,null,null,null,null,null,null,null,null,null,null,null,{"$f":"J1880+O1880","v":0}]
[null,null,null,null,null,null,null,null,null,null,null,null,null,null,null,{"$f":"J1881+O1881","v":0}]
[null,null,null,null,null,null,null,null,null,null,null,null,null,null,null,{"$f":"J1882+O1882","v":0}]
[null,null,null,null,null,null,null,null,null,null,null,null,null,null,null,{"$f":"J1883+O1883","v":0}]
[null,null,null,null,null,null,null,null,null,null,null,null,null,null,null,{"$f":"J1884+O1884","v":0}]
[null,null,null,null,null,null,null,null,null,null,null,null,null,null,null,{"$f":"J1885+O1885","v":0}]
[null,null,null,null,null,null,null,null,null,null,null,null,null,null,null,{"$f":"J1886+O1886","v":0}]
[null,null,null,null,null,null,null,null,null,null,null,null,null,null,null,{"$f":"J1887+O1887","v":0}]
[null,null,null,null,null,null,null,null,null,null,null,null,null,null,null,{"$f":"J1888+O1888","v":0}]
[null,null,null,null,null,null,null,null,null,null,null,null,null,null,null,{"$f":"J1889+O1889","v":0}]
[null,null,null,null,null,null,null,null,null,null,null,null,null,null,null,{"$f":"J1890+O1890","v":0}]
[null,null,null,null,null,null,null,null,null,null,null,null,null,null,null,{"$f":"J1891+O1891","v":0}]
[null,null,null,null,null,null,null,null,null,null,null,null,null,null,null,{"$f":"J1892+O1892","v":0}]
[null,null,null,null,null,null,null,null,null,null,null,null,null,null,null,{"$f":"J1893+O1893","v":0}]
[null,null,null,null,null,null,null,null,null,null,null,null,null,null,null,{"$f":"J1894+O1894","v":0}]
[null,null,null,null,null,null,null,null,null,null,null,null,null,null,null,{"$f":"J1895+O1895","v":0}]
[null,null,null,null,null,null,null,null,null,null,null,null,null,null,null,{"$f":"J1896+O1896","v":0}]
[null,null,null,null,null,null,null,null,null,null,null,null,null,null,null,{"$f":"J1897+O1897","v":0}]
[null,null,null,null,null,null,null,null,null,null,null,null,null,null,null,{"$f":"J1898+O1898","v":0}]
[null,null,null,null,null,null,null,null,null,null,null,null,null,null,null,{"$f":"J1899+O1899","v":0}]
[null,null,null,null,null,null,null,null,null,null,null,null,null,null,null,{"$f":"J1900+O1900","v":0}]
[null,null,null,null,null,null,null,null,null,null,null,null,null,null,null,{"$f":"J1901+O1901","v":0}]
[null,null,null,null,null,null,null,null,null,null,null,null,null,null,null,{"$f":"J1902+O1902","v":0}]
[null,null,null,null,null,null,null,null,null,null,null,null,null,null,null,{"$f":"J1903+O1903","v":0}]
[null,null,null,null,null,null,null,null,null,null,null,null,null,null,null,{"$f":"J1904+O1904","v":0}]
[null,null,null,null,null,null,null,null,null,null,null,null,null,null,null,{"$f":"J1905+O1905","v":0}]
[null,null,null,null,null,null,null,null,null,null,null,null,null,null,null,{"$f":"J1906+O1906","v":0}]
[null,null,null,null,null,null,null,null,null,null,null,null,null,null,null,{"$f":"J1907+O1907","v":0}]
[null,null,null,null,null,null,null,null,null,null,null,null,null,null,null,{"$f":"J1908+O1908","v":0}]
[null,null,null,null,null,null,null,null,null,null,null,null,null,null,null,{"$f":"J1909+O1909","v":0}]
[null,null,null,null,null,null,null,null,null,null,null,null,null,null,null,{"$f":"J1910+O1910","v":0}]
[null,null,null,null,null,null,null,null,null,null,null,null,null,null,null,{"$f":"J1911+O1911","v":0}]
[null,null,null,null,null,null,null,null,null,null,null,null,null,null,null,{"$f":"J1912+O1912","v":0}]
[null,null,null,null,null,null,null,null,null,null,null,null,null,null,null,{"$f":"J1913+O1913","v":0}]
[null,null,null,null,null,null,null,null,null,null,null,null,null,null,null,{"$f":"J1914+O1914","v":0}]
[null,null,null,null,null,null,null,null,null,null,null,null,null,null,null,{"$f":"J1915+O1915","v":0}]
[null,null,null,null,null,null,null,null,null,null,null,null,null,null,null,{"$f":"J1916+O1916","v":0}]
[null,null,null,null,null,null,null,null,null,null,null,null,null,null,null,{"$f":"J1917+O1917","v":0}]
[null,null,null,null,null,null,null,null,null,null,null,null,null,null,null,{"$f":"J1918+O1918","v":0}]
[null,null,null,null,null,null,null,null,null,null,null,null,null,null,null,{"$f":"J1919+O1919","v":0}]
[null,null,null,null,null,null,null,null,null,null,null,null,null,null,null,{"$f":"J1920+O1920","v":0}]
[null,null,null,null,null,null,null,null,null,null,null,null,null,null,null,{"$f":"J1921+O1921","v":0}]
[null,null,null,null,null,null,null,null,null,null,null,null,null,null,null,{"$f":"J1922+O1922","v":0}]
[null,null,null,null,null,null,null,null,null,null,null,null,null,null,null,{"$f":"J1923+O1923","v":0}]
[null,null,null,null,null,null,null,null,null,null,null,null,null,null,null,{"$f":"J1924+O1924","v":0}]
[null,null,null,null,null,null,null,null,null,null,null,null,null,null,null,{"$f":"J1925+O1925","v":0}]
[null,null,null,null,null,null,null,null,null,null,null,null,null,null,null,{"$f":"J1926+O1926","v":0}]
[null,null,null,null,null,null,null,null,null,null,null,null,null,null,null,{"$f":"J1927+O1927","v":0}]
[null,null,null,null,null,null,null,null,null,null,null,null,null,null,null,{"$f":"J1928+O1928","v":0}]
[null,null,null,null,null,null,null,null,null,null,null,null,null,null,null,{"$f":"J1929+O1929","v":0}]
[null,null,null,null,null,null,null,null,null,null,null,null,null,null,null,{"$f":"J1930+O1930","v":0}]
[null,null,null,null,null,null,null,null,null,null,null,null,null,null,null,{"$f":"J1931+O1931","v":0}]
[null,null,null,null,null,null,null,null,null,null,null,null,null,null,null,{"$f":"J1932+O1932","v":0}]
[null,null,null,null,null,null,null,null,null,null,null,null,null,null,null,{"$f":"J1933+O1933","v":0}]
[null,null,null,null,null,null,null,null,null,null,null,null,null,null,null,{"$f":"J1934+O1934","v":0}]
[null,null,null,null,null,null,null,null,null,null,null,null,null,null,null,{"$f":"J1935+O1935","v":0}]
[null,null,null,null,null,null,null,null,null,null,null,null,null,null,null,{"$f":"J1936+O1936","v":0}]
[null,null,null,null,null,null,null,null,null,null,null,null,null,null,null,{"$f":"J1937+O1937","v":0}]
[null,null,null,null,null,null,null,null,null,null,null,null,null,null,null,{"$f":"J1938+O1938","v":0}]
[null,null,null,null,null,null,null,null,null,null,null,null,null,null,null,{"$f":"J1939+O1939","v":0}]
[null,null,null,null,null,null,null,null,null,null,null,null,null,null,null,{"$f":"J1940+O1940","v":0}]
[null,null,null,null,null,null,null,null,null,null,null,null,null,null,null,{"$f":"J1941+O1941","v":0}]
[null,null,null,null,null,null,null,null,null,null,null,null,null,null,null,{"$f":"J1942+O1942","v":0}]
[null,null,null,null,null,null,null,null,null,null,null,null,null,null,null,{"$f":"J1943+O1943","v":0}]
[null,null,null,null,null,null,null,null,null,null,null,null,null,null,null,{"$f":"J1944+O1944","v":0}]
[null,null,null,null,null,null,null,null,null,null,null,null,null,null,null,{"$f":"J1945+O1945","v":0}]
[null,null,null,null,null,null,null,null,null,null,null,null,null,null,null,{"$f":"J1946+O1946","v":0}]
[null,null,null,null,null,null,null,null,null,null,null,null,null,null,null,{"$f":"J1947+O1947","v":0}]
[null,null,null,null,null,null,null,null,null,null,null,null,null,null,null,{"$f":"J1948+O1948","v":0}]
[null,null,null,null,null,null,null,null,null,null,null,null,null,null,null,{"$f":"J1949+O1949","v":0}]
[null,null,null,null,null,null,null,null,null,null,null,null,null,null,null,{"$f":"J1950+O1950","v":0}]
[null,null,null,null,null,null,null,null,null,null,null,null,null,null,null,{"$f":"J1951+O1951","v":0}]
[null,null,null,null,null,null,null,null,null,null,null,null,null,null,null,{"$f":"J1952+O1952","v":0}]
[null,null,null,null,null,null,null,null,null,null,null,null,null,null,null,{"$f":"J1953+O1953","v":0}]
[null,null,null,null,null,null,null,null,null,null,null,null,null,null,null,{"$f":"J1954+O1954","v":0}]
[null,null,null,null,null,null,null,null,null,null,null,null,null,null,null,{"$f":"J1955+O1955","v":0}]
[null,null,null,null,null,null,null,null,null,null,null,null,null,null,null,{"$f":"J1956+O1956","v":0}]
[null,null,null,null,null,null,null,null,null,null,null,null,null,null,null,{"$f":"J1957+O1957","v":0}]
[null,null,null,null,null,null,null,null,null,null,null,null,null,null,null,{"$f":"J1958+O1958","v":0}]
[null,null,null,null,null,null,null,null,null,null,null,null,null,null,null,{"$f":"J1959+O1959","v":0}]
[null,null,null,null,null,null,null,null,null,null,null,null,null,null,null,{"$f":"J1960+O1960","v":0}]
[null,null,null,null,null,null,null,null,null,null,null,null,null,null,null,{"$f":"J1961+O1961","v":0}]
[null,null,null,null,null,null,null,null,null,null,null,null,null,null,null,{"$f":"J1962+O1962","v":0}]
[null,null,null,null,null,null,null,null,null,null,null,null,null,null,null,{"$f":"J1963+O1963","v":0}]
[null,null,null,null,null,null,null,null,null,null,null,null,null,null,null,{"$f":"J1964+O1964","v":0}]
[null,null,null,null,null,null,null,null,null,null,null,null,null,null,null,{"$f":"J1965+O1965","v":0}]
[null,null,null,null,null,null,null,null,null,null,null,null,null,null,null,{"$f":"J1966+O1966","v":0}]
[null,null,null,null,null,null,null,null,null,null,null,null,null,null,null,{"$f":"J1967+O1967","v":0}]
[null,null,null,null,null,null,null,null,null,null,null,null,null,null,null,{"$f":"J1968+O1968","v":0}]
[null,null,null,null,null,null,null,null,null,null,null,null,null,null,null,{"$f":"J1969+O1969","v":0}]
[null,null,null,null,null,null,null,null,null,null,null,null,null,null,null,{"$f":"J1970+O1970","v":0}]
[null,null,null,null,null,null,null,null,null,null,null,null,null,null,null,{"$f":"J1971+O1971","v":0}]
[null,null,null,null,null,null,null,null,null,null,null,null,null,null,null,{"$f":"J1972+O1972","v":0}]
[null,null,null,null,null,null,null,null,null,null,null,null,null,null,null,{"$f":"J1973+O1973","v":0}]
[null,null,null,null,null,null,null,null,null,null,null,null,null,null,null,{"$f":"J1974+O1974","v":0}]
[null,null,null,null,null,null,null,null,null,null,null,null,null,null,null,{"$f":"J1975+O1975","v":0}]
[null,null,null,null,null,null,null,null,null,null,null,null,null,null,null,{"$f":"J1976+O1976","v":0}]
[null,null,null,null,null,null,null,null,null,null,null,null,null,null,null,{"$f":"J1977+O1977","v":0}]
[null,null,null,null,null,null,null,null,null,null,null,null,null,null,null,{"$f":"J1978+O1978","v":0}]
[null,null,null,null,null,null,null,null,null,null,null,null,null,null,null,{"$f":"J1979+O1979","v":0}]
[null,null,null,null,null,null,null,null,null,null,null,null,null,null,null,{"$f":"J1980+O1980","v":0}]
[null,null,null,null,null,null,null,null,null,null,null,null,null,null,null,{"$f":"J1981+O1981","v":0}]
[null,null,null,null,null,null,null,null,null,null,null,null,null,null,null,{"$f":"J1982+O1982","v":0}]
[null,null,null,null,null,null,null,null,null,null,null,null,null,null,null,{"$f":"J1983+O1983","v":0}]
[null,null,null,null,null,null,null,null,null,null,null,null,null,null,null,{"$f":"J1984+O1984","v":0}]
[null,null,null,null,null,null,null,null,null,null,null,null,null,null,null,{"$f":"J1985+O1985","v":0}]
[null,null,null,null,null,null,null,null,null,null,null,null,null,null,null,{"$f":"J1986+O1986","v":0}]
[null,null,null,null,null,null,null,null,null,null,null,null,null,null,null,{"$f":"J1987+O1987","v":0}]
[null,null,null,null,null,null,null,null,null,null,null,null,null,null,null,{"$f":"J1988+O1988","v":0}]
[null,null,null,null,null,null,null,null,null,null,null,null,null,null,null,{"$f":"J1989+O1989","v":0}]
[null,null,null,null,null,null,null,null,null,null,null,null,null,null,null,{"$f":"J1990+O1990","v":0}]
[null,null,null,null,null,null,null,null,null,null,null,null,null,null,null,{"$f":"J1991+O1991","v":0}]
[null,null,null,null,null,null,null,null,null,null,null,null,null,null,null,{"$f":"J1992+O1992","v":0}]
[null,null,null,null,null,null,null,null,null,null,null,null,null,null,null,{"$f":"J1993+O1993","v":0}]
[null,null,null,null,null,null,null,null,null,null,null,null,null,null,null,{"$f":"J1994+O1994","v":0}]
[null,null,null,null,null,null,null,null,null,null,null,null,null,null,null,{"$f":"J1995+O1995","v":0}]
[null,null,null,null,null,null,null,null,null,null,null,null,null,null,null,{"$f":"J1996+O1996","v":0}]
[null,null,null,null,null,null,null,null,null,null,null,null,null,null,null,{"$f":"J1997+O1997","v":0}]
[null,null,null,null,null,null,null,null,null,null,null,null,null,null,null,{"$f":"J1998+O1998","v":0}]
[null,null,null,null,null,null,null,null,null,null,null,null,null,null,null,{"$f":"J1999+O1999","v":0}]
[null,null,null,null,null,null,null,null,null,null,null,null,null,null,null,{"$f":"J2000+O2000","v":0}]
[null,null,null,null,null,null,null,null,null,null,null,null,null,null,null,{"$f":"J2001+O2001","v":0}]
[null,null,null,null,null,null,null,null,null,null,null,null,null,null,null,{"$f":"J2002+O2002","v":0}]
[null,null,null,null,null,null,null,null,null,null,null,null,null,null,null,{"$f":"J2003+O2003","v":0}]
[null,null,null,null,null,null,null,null,null,null,null,null,null,null,null,{"$f":"J2004+O2004","v":0}]
[null,null,null,null,null,null,null,null,null,null,null,null,null,null,null,{"$f":"J2005+O2005","v":0}]
[null,null,null,null,null,null,null,null,null,null,null,null,null,null,null,{"$f":"J2006+O2006","v":0}]
[null,null,null,null,null,null,null,null,null,null,null,null,null,null,null,{"$f":"J2007+O2007","v":0}]
[null,null,null,null,null,null,null,null,null,null,null,null,null,null,null,{"$f":"J2008+O2008","v":0}]
[null,null,null,null,null,null,null,null,null,null,null,null,null,null,null,{"$f":"J2009+O2009","v":0}]
[null,null,null,null,null,null,null,null,null,null,null,null,null,null,null,{"$f":"J2010+O2010","v":0}]
[null,null,null,null,null,null,null,null,null,null,null,null,null,null,null,{"$f":"J2011+O2011","v":0}]
[null,null,null,null,null,null,null,null,null,null,null,null,null,null,null,{"$f":"J2012+O2012","v":0}]
[null,null,null,null,null,null,null,null,null,null,null,null,null,null,null,{"$f":"J2013+O2013","v":0}]
[null,null,null,null,null,null,null,null,null,null,null,null,null,null,null,{"$f":"J2014+O2014","v":0}]
[null,null,null,null,null,null,null,null,null,null,null,null,null,null,null,{"$f":"J2015+O2015","v":0}]
[null,null,null,null,null,null,null,null,null,null,null,null,null,null,null,{"$f":"J2016+O2016","v":0}]
[null,null,null,null,null,null,null,null,null,null,null,null,null,null,null,{"$f":"J2017+O2017","v":0}]
[null,null,null,null,null,null,null,null,null,null,null,null,null,null,null,{"$f":"J2018+O2018","v":0}]
[null,null,null,null,null,null,null,null,null,null,null,null,null,null,null,{"$f":"J2019+O2019","v":0}]
[null,null,null,null,null,null,null,null,null,null,null,null,null,null,null,{"$f":"J2020+O2020","v":0}]
[null,null,null,null,null,null,null,null,null,null,null,null,null,null,null,{"$f":"J2021+O2021","v":0}]
[null,null,null,null,null,null,null,null,null,null,null,null,null,null,null,{"$f":"J2022+O2022","v":0}]
[null,null,null,null,null,null,null,null,null,null,null,null,null,null,null,{"$f":"J2023+O2023","v":0}]
[null,null,null,null,null,null,null,null,null,null,null,null,null,null,null,{"$f":"J2024+O2024","v":0}]
[null,null,null,null,null,null,null,null,null,null,null,null,null,null,null,{"$f":"J2025+O2025","v":0}]
[null,null,null,null,null,null,null,null,null,null,null,null,null,null,null,{"$f":"J2026+O2026","v":0}]
[null,null,null,null,null,null,null,null,null,null,null,null,null,null,null,{"$f":"J2027+O2027","v":0}]
[null,null,null,null,null,null,null,null,null,null,null,null,null,null,null,{"$f":"J2028+O2028","v":0}]
[null,null,null,null,null,null,null,null,null,null,null,null,null,null,null,{"$f":"J2029+O2029","v":0}]
[null,null,null,null,null,null,null,null,null,null,null,null,null,null,null,{"$f":"J2030+O2030","v":0}]
[null,null,null,null,null,null,null,null,null,null,null,null,null,null,null,{"$f":"J2031+O2031","v":0}]
[null,null,null,null,null,null,null,null,null,null,null,null,null,null,null,{"$f":"J2032+O2032","v":0}]
[null,null,null,null,null,null,null,null,null,null,null,null,null,null,null,{"$f":"J2033+O2033","v":0}]
[null,null,null,null,null,null,null,null,null,null,null,null,null,null,null,{"$f":"J2034+O2034","v":0}]
[null,null,null,null,null,null,null,null,null,null,null,null,null,null,null,{"$f":"J2035+O2035","v":0}]
[null,null,null,null,null,null,null,null,null,null,null,null,null,null,null,{"$f":"J2036+O2036","v":0}]
[null,null,null,null,null,null,null,null,null,null,null,null,null,null,null,{"$f":"J2037+O2037","v":0}]
[null,null,null,null,null,null,null,null,null,null,null,null,null,null,null,{"$f":"J2038+O2038","v":0}]
[null,null,null,null,null,null,null,null,null,null,null,null,null,null,null,{"$f":"J2039+O2039","v":0}]
[null,null,null,null,null,null,null,null,null,null,null,null,null,null,null,{"$f":"J2040+O2040","v":0}]
[null,null,null,null,null,null,null,null,null,null,null,null,null,null,null,{"$f":"J2041+O2041","v":0}]
[null,null,null,null,null,null,null,null,null,null,null,null,null,null,null,{"$f":"J2042+O2042","v":0}]
[null,null,null,null,null,null,null,null,null,null,null,null,null,null,null,{"$f":"J2043+O2043","v":0}]
[null,null,null,null,null,null,null,null,null,null,null,null,null,null,null,{"$f":"J2044+O2044","v":0}]
[null,null,null,null,null,null,null,null,null,null,null,null,null,null,null,{"$f":"J2045+O2045","v":0}]
[null,null,null,null,null,null,null,null,null,null,null,null,null,null,null,{"$f":"J2046+O2046","v":0}]
[null,null,null,null,null,null,null,null,null,null,null,null,null,null,null,{"$f":"J2047+O2047","v":0}]
[null,null,null,null,null,null,null,null,null,null,null,null,null,null,null,{"$f":"J2048+O2048","v":0}]
[null,null,null,null,null,null,null,null,null,null,null,null,null,null,null,{"$f":"J2049+O2049","v":0}]
[null,null,null,null,null,null,null,null,null,null,null,null,null,null,null,{"$f":"J2050+O2050","v":0}]
[null,null,null,null,null,null,null,null,null,null,null,null,null,null,null,{"$f":"J2051+O2051","v":0}]
[null,null,null,null,null,null,null,null,null,null,null,null,null,null,null,{"$f":"J2052+O2052","v":0}]
[null,null,null,null,null,null,null,null,null,null,null,null,null,null,null,{"$f":"J2053+O2053","v":0}]
[null,null,null,null,null,null,null,null,null,null,null,null,null,null,null,{"$f":"J2054+O2054","v":0}]
[null,null,null,null,null,null,null,null,null,null,null,null,null,null,null,{"$f":"J2055+O2055","v":0}]
[null,null,null,null,null,null,null,null,null,null,null,null,null,null,null,{"$f":"J2056+O2056","v":0}]
[null,null,null,null,null,null,null,null,null,null,null,null,null,null,null,{"$f":"J2057+O2057","v":0}]
[null,null,null,null,null,null,null,null,null,null,null,null,null,null,null,{"$f":"J2058+O2058","v":0}]
[null,null,null,null,null,null,null,null,null,null,null,null,null,null,null,{"$f":"J2059+O2059","v":0}]
[null,null,null,null,null,null,null,null,null,null,null,null,null,null,null,{"$f":"J2060+O2060","v":0}]
[null,null,null,null,null,null,null,null,null,null,null,null,null,null,null,{"$f":"J2061+O2061","v":0}]
[null,null,null,null,null,null,null,null,null,null,null,null,null,null,null,{"$f":"J2062+O2062","v":0}]
[null,null,null,null,null,null,null,null,null,null,null,null,null,null,null,{"$f":"J2063+O2063","v":0}]
[null,null,null,null,null,null,null,null,null,null,null,null,null,null,null,{"$f":"J2064+O2064","v":0}]
[null,null,null,null,null,null,null,null,null,null,null,null,null,null,null,{"$f":"J2065+O2065","v":0}]
[null,null,null,null,null,null,null,null,null,null,null,null,null,null,null,{"$f":"J2066+O2066","v":0}]
[null,null,null,null,null,null,null,null,null,null,null,null,null,null,null,{"$f":"J2067+O2067","v":0}]
[null,null,null,null,null,null,null,null,null,null,null,null,null,null,null,{"$f":"J2068+O2068","v":0}]
[null,null,null,null,null,null,null,null,null,null,null,null,null,null,null,{"$f":"J2069+O2069","v":0}]
[null,null,null,null,null,null,null,null,null,null,null,null,null,null,null,{"$f":"J2070+O2070","v":0}]
[null,null,null,null,null,null,null,null,null,null,null,null,null,null,null,{"$f":"J2071+O2071","v":0}]
[null,null,null,null,null,null,null,null,null,null,null,null,null,null,null,{"$f":"J2072+O2072","v":0}]
[null,null,null,null,null,null,null,null,null,null,null,null,null,null,null,{"$f":"J2073+O2073","v":0}]
[null,null,null,null,null,null,null,null,null,null,null,null,null,null,null,{"$f":"J2074+O2074","v":0}]
[null,null,null,null,null,null,null,null,null,null,null,null,null,null,null,{"$f":"J2075+O2075","v":0}]
[null,null,null,null,null,null,null,null,null,null,null,null,null,null,null,{"$f":"J2076+O2076","v":0}]
[null,null,null,null,null,null,null,null,null,null,null,null,null,null,null,{"$f":"J2077+O2077","v":0}]
[null,null,null,null,null,null,null,null,null,null,null,null,null,null,null,{"$f":"J2078+O2078","v":0}]
[null,null,null,null,null,null,null,null,null,null,null,null,null,null,null,{"$f":"J2079+O2079","v":0}]
[null,null,null,null,null,null,null,null,null,null,null,null,null,null,null,{"$f":"J2080+O2080","v":0}]
[null,null,null,null,null,null,null,null,null,null,null,null,null,null,null,{"$f":"J2081+O2081","v":0}]
[null,null,null,null,null,null,null,null,null,null,null,null,null,null,null,{"$f":"J2082+O2082","v":0}]
[null,null,null,null,null,null,null,null,null,null,null,null,null,null,null,{"$f":"J2083+O2083","v":0}]
[null,null,null,null,null,null,null,null,null,null,null,null,null,null,null,{"$f":"J2084+O2084","v":0}]
[null,null,null,null,null,null,null,null,null,null,null,null,null,null,null,{"$f":"J2085+O2085","v":0}]
[null,null,null,null,null,null,null,null,null,null,null,null,null,null,null,{"$f":"J2086+O2086","v":0}]
[null,null,null,null,null,null,null,null,null,null,null,null,null,null,null,{"$f":"J2087+O2087","v":0}]
[null,null,null,null,null,null,null,null,null,null,null,null,null,null,null,{"$f":"J2088+O2088","v":0}]
[null,null,null,null,null,null,null,null,null,null,null,null,null,null,null,{"$f":"J2089+O2089","v":0}]
[null,null,null,null,null,null,null,null,null,null,null,null,null,null,null,{"$f":"J2090+O2090","v":0}]
[null,null,null,null,null,null,null,null,null,null,null,null,null,null,null,{"$f":"J2091+O2091","v":0}]
[null,null,null,null,null,null,null,null,null,null,null,null,null,null,null,{"$f":"J2092+O2092","v":0}]
[null,null,null,null,null,null,null,null,null,null,null,null,null,null,null,{"$f":"J2093+O2093","v":0}]
[null,null,null,null,null,null,null,null,null,null,null,null,null,null,null,{"$f":"J2094+O2094","v":0}]
[null,null,null,null,null,null,null,null,null,null,null,null,null,null,null,{"$f":"J2095+O2095","v":0}]
[null,null,null,null,null,null,null,null,null,null,null,null,null,null,null,{"$f":"J2096+O2096","v":0}]
[null,null,null,null,null,null,null,null,null,null,null,null,null,null,null,{"$f":"J2097+O2097","v":0}]
[null,null,null,null,null,null,null,null,null,null,null,null,null,null,null,{"$f":"J2098+O2098","v":0}]
[null,null,null,null,null,null,null,null,null,null,null,null,null,null,null,{"$f":"J2099+O2099","v":0}]
[null,null,null,null,null,null,null,null,null,null,null,null,null,null,null,{"$f":"J2100+O2100","v":0}]
[null,null,null,null,null,null,null,null,null,null,null,null,null,null,null,{"$f":"J2101+O2101","v":0}]
[null,null,null,null,null,null,null,null,null,null,null,null,null,null,null,{"$f":"J2102+O2102","v":0}]
[null,null,null,null,null,null,null,null,null,null,null,null,null,null,null,{"$f":"J2103+O2103","v":0}]
[null,null,null,null,null,null,null,null,null,null,null,null,null,null,null,{"$f":"J2104+O2104","v":0}]
[null,null,null,null,null,null,null,null,null,null,null,null,null,null,null,{"$f":"J2105+O2105","v":0}]
[null,null,null,null,null,null,null,null,null,null,null,null,null,null,null,{"$f":"J2106+O2106","v":0}]
[null,null,null,null,null,null,null,null,null,null,null,null,null,null,null,{"$f":"J2107+O2107","v":0}]
[null,null,null,null,null,null,null,null,null,null,null,null,null,null,null,{"$f":"J2108+O2108","v":0}]
[null,null,null,null,null,null,null,null,null,null,null,null,null,null,null,{"$f":"J2109+O2109","v":0}]
[null,null,null,null,null,null,null,null,null,null,null,null,null,null,null,{"$f":"J2110+O2110","v":0}]
[null,null,null,null,null,null,null,null,null,null,null,null,null,null,null,{"$f":"J2111+O2111","v":0}]
[null,null,null,null,null,null,null,null,null,null,null,null,null,null,null,{"$f":"J2112+O2112","v":0}]
[null,null,null,null,null,null,null,null,null,null,null,null,null,null,null,{"$f":"J2113+O2113","v":0}]
[null,null,null,null,null,null,null,null,null,null,null,null,null,null,null,{"$f":"J2114+O2114","v":0}]
[null,null,null,null,null,null,null,null,null,null,null,null,null,null,null,{"$f":"J2115+O2115","v":0}]
[null,null,null,null,null,null,null,null,null,null,null,null,null,null,null,{"$f":"J2116+O2116","v":0}]
[null,null,null,null,null,null,null,null,null,null,null,null,null,null,null,{"$f":"J2117+O2117","v":0}]
[null,null,null,null,null,null,null,null,null,null,null,null,null,null,null,{"$f":"J2118+O2118","v":0}]
[null,null,null,null,null,null,null,null,null,null,null,null,null,null,null,{"$f":"J2119+O2119","v":0}]
[null,null,null,null,null,null,null,null,null,null,null,null,null,null,null,{"$f":"J2120+O2120","v":0}]
[null,null,null,null,null,null,null,null,null,null,null,null,null,null,null,{"$f":"J2121+O2121","v":0}]
[null,null,null,null,null,null,null,null,null,null,null,null,null,null,null,{"$f":"J2122+O2122","v":0}]
[null,null,null,null,null,null,null,null,null,null,null,null,null,null,null,{"$f":"J2123+O2123","v":0}]
[null,null,null,null,null,null,null,null,null,null,null,null,null,null,null,{"$f":"J2124+O2124","v":0}]
[null,null,null,null,null,null,null,null,null,null,null,null,null,null,null,{"$f":"J2125+O2125","v":0}]
[null,null,null,null,null,null,null,null,null,null,null,null,null,null,null,{"$f":"J2126+O2126","v":0}]
[null,null,null,null,null,null,null,null,null,null,null,null,null,null,null,{"$f":"J2127+O2127","v":0}]
[null,null,null,null,null,null,null,null,null,null,null,null,null,null,null,{"$f":"J2128+O2128","v":0}]
[null,null,null,null,null,null,null,null,null,null,null,null,null,null,null,{"$f":"J2129+O2129","v":0}]
[null,null,null,null,null,null,null,null,null,null,null,null,null,null,null,{"$f":"J2130+O2130","v":0}]
[null,null,null,null,null,null,null,null,null,null,null,null,null,null,null,{"$f":"J2131+O2131","v":0}]
[null,null,null,null,null,null,null,null,null,null,null,null,null,null,null,{"$f":"J2132+O2132","v":0}]
[null,null,null,null,null,null,null,null,null,null,null,null,null,null,null,{"$f":"J2133+O2133","v":0}]
[null,null,null,null,null,null,null,null,null,null,null,null,null,null,null,{"$f":"J2134+O2134","v":0}]
[null,null,null,null,null,null,null,null,null,null,null,null,null,null,null,{"$f":"J2135+O2135","v":0}]
[null,null,null,null,null,null,null,null,null,null,null,null,null,null,null,{"$f":"J2136+O2136","v":0}]
[null,null,null,null,null,null,null,null,null,null,null,null,null,null,null,{"$f":"J2137+O2137","v":0}]
[null,null,null,null,null,null,null,null,null,null,null,null,null,null,null,{"$f":"J2138+O2138","v":0}]
[null,null,null,null,null,null,null,null,null,null,null,null,null,null,null,{"$f":"J2139+O2139","v":0}]
[null,null,null,null,null,null,null,null,null,null,null,null,null,null,null,{"$f":"J2140+O2140","v":0}]
[null,null,null,null,null,null,null,null,null,null,null,null,null,null,null,{"$f":"J2141+O2141","v":0}]
[null,null,null,null,null,null,null,null,null,null,null,null,null,null,null,{"$f":"J2142+O2142","v":0}]
[null,null,null,null,null,null,null,null,null,null,null,null,null,null,null,{"$f":"J2143+O2143","v":0}]
[null,null,null,null,null,null,null,null,null,null,null,null,null,null,null,{"$f":"J2144+O2144","v":0}]
[null,null,null,null,null,null,null,null,null,null,null,null,null,null,null,{"$f":"J2145+O2145","v":0}]
[null,null,null,null,null,null,null,null,null,null,null,null,null,null,null,{"$f":"J2146+O2146","v":0}]
[null,null,null,null,null,null,null,null,null,null,null,null,null,null,null,{"$f":"J2147+O2147","v":0}]
[null,null,null,null,null,null,null,null,null,null,null,null,null,null,null,{"$f":"J2148+O2148","v":0}]
[null,null,null,null,null,null,null,null,null,null,null,null,null,null,null,{"$f":"J2149+O2149","v":0}]
[null,null,null,null,null,null,null,null,null,null,null,null,null,null,null,{"$f":"J2150+O2150","v":0}]
[null,null,null,null,null,null,null,null,null,null,null,null,null,null,null,{"$f":"J2151+O2151","v":0}]
[null,null,null,null,null,null,null,null,null,null,null,null,null,null,null,{"$f":"J2152+O2152","v":0}]
[null,null,null,null,null,null,null,null,null,null,null,null,null,null,null,{"$f":"J2153+O2153","v":0}]
[null,null,null,null,null,null,null,null,null,null,null,null,null,null,null,{"$f":"J2154+O2154","v":0}]
[null,null,null,null,null,null,null,null,null,null,null,null,null,null,null,{"$f":"J2155+O2155","v":0}]
[null,null,null,null,null,null,null,null,null,null,null,null,null,null,null,{"$f":"J2156+O2156","v":0}]
[null,null,null,null,null,null,null,null,null,null,null,null,null,null,null,{"$f":"J2157+O2157","v":0}]
[null,null,null,null,null,null,null,null,null,null,null,null,null,null,null,{"$f":"J2158+O2158","v":0}]
[null,null,null,null,null,null,null,null,null,null,null,null,null,null,null,{"$f":"J2159+O2159","v":0}]
[null,null,null,null,null,null,null,null,null,null,null,null,null,null,null,{"$f":"J2160+O2160","v":0}]
[null,null,null,null,null,null,null,null,null,null,null,null,null,null,null,{"$f":"J2161+O2161","v":0}]
[null,null,null,null,null,null,null,null,null,null,null,null,null,null,null,{"$f":"J2162+O2162","v":0}]
[null,null,null,null,null,null,null,null,null,null,null,null,null,null,null,{"$f":"J2163+O2163","v":0}]
[null,null,null,null,null,null,null,null,null,null,null,null,null,null,null,{"$f":"J2164+O2164","v":0}]
[null,null,null,null,null,null,null,null,null,null,null,null,null,null,null,{"$f":"J2165+O2165","v":0}]
[null,null,null,null,null,null,null,null,null,null,null,null,null,null,null,{"$f":"J2166+O2166","v":0}]
[null,null,null,null,null,null,null,null,null,null,null,null,null,null,null,{"$f":"J2167+O2167","v":0}]
[null,null,null,null,null,null,null,null,null,null,null,null,null,null,null,{"$f":"J2168+O2168","v":0}]
[null,null,null,null,null,null,null,null,null,null,null,null,null,null,null,{"$f":"J2169+O2169","v":0}]
[null,null,null,null,null,null,null,null,null,null,null,null,null,null,null,{"$f":"J2170+O2170","v":0}]
[null,null,null,null,null,null,null,null,null,null,null,null,null,null,null,{"$f":"J2171+O2171","v":0}]
[null,null,null,null,null,null,null,null,null,null,null,null,null,null,null,{"$f":"J2172+O2172","v":0}]
[null,null,null,null,null,null,null,null,null,null,null,null,null,null,null,{"$f":"J2173+O2173","v":0}]
[null,null,null,null,null,null,null,null,null,null,null,null,null,null,null,{"$f":"J2174+O2174","v":0}]
[null,null,null,null,null,null,null,null,null,null,null,null,null,null,null,{"$f":"J2175+O2175","v":0}]
[null,null,null,null,null,null,null,null,null,null,null,null,null,null,null,{"$f":"J2176+O2176","v":0}]
[null,null,null,null,null,null,null,null,null,null,null,null,null,null,null,{"$f":"J2177+O2177","v":0}]
[null,null,null,null,null,null,null,null,null,null,null,null,null,null,null,{"$f":"J2178+O2178","v":0}]
[null,null,null,null,null,null,null,null,null,null,null,null,null,null,null,{"$f":"J2179+O2179","v":0}]
[null,null,null,null,null,null,null,null,null,null,null,null,null,null,null,{"$f":"J2180+O2180","v":0}]
[null,null,null,null,null,null,null,null,null,null,null,null,null,null,null,{"$f":"J2181+O2181","v":0}]
[null,null,null,null,null,null,null,null,null,null,null,null,null,null,null,{"$f":"J2182+O2182","v":0}]
[null,null,null,null,null,null,null,null,null,null,null,null,null,null,null,{"$f":"J2183+O2183","v":0}]
[null,null,null,null,null,null,null,null,null,null,null,null,null,null,null,{"$f":"J2184+O2184","v":0}]
[null,null,null,null,null,null,null,null,null,null,null,null,null,null,null,{"$f":"J2185+O2185","v":0}]
[null,null,null,null,null,null,null,null,null,null,null,null,null,null,null,{"$f":"J2186+O2186","v":0}]
[null,null,null,null,null,null,null,null,null,null,null,null,null,null,null,{"$f":"J2187+O2187","v":0}]
[null,null,null,null,null,null,null,null,null,null,null,null,null,null,null,{"$f":"J2188+O2188","v":0}]
[null,null,null,null,null,null,null,null,null,null,null,null,null,null,null,{"$f":"J2189+O2189","v":0}]
[null,null,null,null,null,null,null,null,null,null,null,null,null,null,null,{"$f":"J2190+O2190","v":0}]
[null,null,null,null,null,null,null,null,null,null,null,null,null,null,null,{"$f":"J2191+O2191","v":0}]
[null,null,null,null,null,null,null,null,null,null,null,null,null,null,null,{"$f":"J2192+O2192","v":0}]
[null,null,null,null,null,null,null,null,null,null,null,null,null,null,null,{"$f":"J2193+O2193","v":0}]
[null,null,null,null,null,null,null,null,null,null,null,null,null,null,null,{"$f":"J2194+O2194","v":0}]
[null,null,null,null,null,null,null,null,null,null,null,null,null,null,null,{"$f":"J2195+O2195","v":0}]
[null,null,null,null,null,null,null,null,null,null,null,null,null,null,null,{"$f":"J2196+O2196","v":0}]
[null,null,null,null,null,null,null,null,null,null,null,null,null,null,null,{"$f":"J2197+O2197","v":0}]
[null,null,null,null,null,null,null,null,null,null,null,null,null,null,null,{"$f":"J2198+O2198","v":0}]
[null,null,null,null,null,null,null,null,null,null,null,null,null,null,null,{"$f":"J2199+O2199","v":0}]
[null,null,null,null,null,null,null,null,null,null,null,null,null,null,null,{"$f":"J2200+O2200","v":0}]
[null,null,null,null,null,null,null,null,null,null,null,null,null,null,null,{"$f":"J2201+O2201","v":0}]
[null,null,null,null,null,null,null,null,null,null,null,null,null,null,null,{"$f":"J2202+O2202","v":0}]
[null,null,null,null,null,null,null,null,null,null,null,null,null,null,null,{"$f":"J2203+O2203","v":0}]
[null,null,null,null,null,null,null,null,null,null,null,null,null,null,null,{"$f":"J2204+O2204","v":0}]
[null,null,null,null,null,null,null,null,null,null,null,null,null,null,null,{"$f":"J2205+O2205","v":0}]
[null,null,null,null,null,null,null,null,null,null,null,null,null,null,null,{"$f":"J2206+O2206","v":0}]
[null,null,null,null,null,null,null,null,null,null,null,null,null,null,null,{"$f":"J2207+O2207","v":0}]
[null,null,null,null,null,null,null,null,null,null,null,null,null,null,null,{"$f":"J2208+O2208","v":0}]
[null,null,null,null,null,null,null,null,null,null,null,null,null,null,null,{"$f":"J2209+O2209","v":0}]
[null,null,null,null,null,null,null,null,null,null,null,null,null,null,null,{"$f":"J2210+O2210","v":0}]
[null,null,null,null,null,null,null,null,null,null,null,null,null,null,null,{"$f":"J2211+O2211","v":0}]
[null,null,null,null,null,null,null,null,null,null,null,null,null,null,null,{"$f":"J2212+O2212","v":0}]
[null,null,null,null,null,null,null,null,null,null,null,null,null,null,null,{"$f":"J2213+O2213","v":0}]
[null,null,null,null,null,null,null,null,null,null,null,null,null,null,null,{"$f":"J2214+O2214","v":0}]
[null,null,null,null,null,null,null,null,null,null,null,null,null,null,null,{"$f":"J2215+O2215","v":0}]
[null,null,null,null,null,null,null,null,null,null,null,null,null,null,null,{"$f":"J2216+O2216","v":0}]
[null,null,null,null,null,null,null,null,null,null,null,null,null,null,null,{"$f":"J2217+O2217","v":0}]
[null,null,null,null,null,null,null,null,null,null,null,null,null,null,null,{"$f":"J2218+O2218","v":0}]
[null,null,null,null,null,null,null,null,null,null,null,null,null,null,null,{"$f":"J2219+O2219","v":0}]
[null,null,null,null,null,null,null,null,null,null,null,null,null,null,null,{"$f":"J2220+O2220","v":0}]
[null,null,null,null,null,null,null,null,null,null,null,null,null,null,null,{"$f":"J2221+O2221","v":0}]
[null,null,null,null,null,null,null,null,null,null,null,null,null,null,null,{"$f":"J2222+O2222","v":0}]
[null,null,null,null,null,null,null,null,null,null,null,null,null,null,null,{"$f":"J2223+O2223","v":0}]
[null,null,null,null,null,null,null,null,null,null,null,null,null,null,null,{"$f":"J2224+O2224","v":0}]
[null,null,null,null,null,null,null,null,null,null,null,null,null,null,null,{"$f":"J2225+O2225","v":0}]
[null,null,null,null,null,null,null,null,null,null,null,null,null,null,null,{"$f":"J2226+O2226","v":0}]
[null,null,null,null,null,null,null,null,null,null,null,null,null,null,null,{"$f":"J2227+O2227","v":0}]
[null,null,null,null,null,null,null,null,null,null,null,null,null,null,null,{"$f":"J2228+O2228","v":0}]
[null,null,null,null,null,null,null,null,null,null,null,null,null,null,null,{"$f":"J2229+O2229","v":0}]
[null,null,null,null,null,null,null,null,null,null,null,null,null,null,null,{"$f":"J2230+O2230","v":0}]
[null,null,null,null,null,null,null,null,null,null,null,null,null,null,null,{"$f":"J2231+O2231","v":0}]
[null,null,null,null,null,null,null,null,null,null,null,null,null,null,null,{"$f":"J2232+O2232","v":0}]
[null,null,null,null,null,null,null,null,null,null,null,null,null,null,null,{"$f":"J2233+O2233","v":0}]
[null,null,null,null,null,null,null,null,null,null,null,null,null,null,null,{"$f":"J2234+O2234","v":0}]
[null,null,null,null,null,null,null,null,null,null,null,null,null,null,null,{"$f":"J2235+O2235","v":0}]
[null,null,null,null,null,null,null,null,null,null,null,null,null,null,null,{"$f":"J2236+O2236","v":0}]
[null,null,null,null,null,null,null,null,null,null,null,null,null,null,null,{"$f":"J2237+O2237","v":0}]
[null,null,null,null,null,null,null,null,null,null,null,null,null,null,null,{"$f":"J2238+O2238","v":0}]
[null,null,null,null,null,null,null,null,null,null,null,null,null,null,null,{"$f":"J2239+O2239","v":0}]
[null,null,null,null,null,null,null,null,null,null,null,null,null,null,null,{"$f":"J2240+O2240","v":0}]
[null,null,null,null,null,null,null,null,null,null,null,null,null,null,null,{"$f":"J2241+O2241","v":0}]
[null,null,null,null,null,null,null,null,null,null,null,null,null,null,null,{"$f":"J2242+O2242","v":0}]
[null,null,null,null,null,null,null,null,null,null,null,null,null,null,null,{"$f":"J2243+O2243","v":0}]
[null,null,null,null,null,null,null,null,null,null,null,null,null,null,null,{"$f":"J2244+O2244","v":0}]
[null,null,null,null,null,null,null,null,null,null,null,null,null,null,null,{"$f":"J2245+O2245","v":0}]
[null,null,null,null,null,null,null,null,null,null,null,null,null,null,null,{"$f":"J2246+O2246","v":0}]
[null,null,null,null,null,null,null,null,null,null,null,null,null,null,null,{"$f":"J2247+O2247","v":0}]
[null,null,null,null,null,null,null,null,null,null,null,null,null,null,null,{"$f":"J2248+O2248","v":0}]
[null,null,null,null,null,null,null,null,null,null,null,null,null,null,null,{"$f":"J2249+O2249","v":0}]
[null,null,null,null,null,null,null,null,null,null,null,null,null,null,null,{"$f":"J2250+O2250","v":0}]
[null,null,null,null,null,null,null,null,null,null,null,null,null,null,null,{"$f":"J2251+O2251","v":0}]
[null,null,null,null,null,null,null,null,null,null,null,null,null,null,null,{"$f":"J2252+O2252","v":0}]
[null,null,null,null,null,null,null,null,null,null,null,null,null,null,null,{"$f":"J2253+O2253","v":0}]
[null,null,null,null,null,null,null,null,null,null,null,null,null,null,null,{"$f":"J2254+O2254","v":0}]
[null,null,null,null,null,null,null,null,null,null,null,null,null,null,null,{"$f":"J2255+O2255","v":0}]
[null,null,null,null,null,null,null,null,null,null,null,null,null,null,null,{"$f":"J2256+O2256","v":0}]
[null,null,null,null,null,null,null,null,null,null,null,null,null,null,null,{"$f":"J2257+O2257","v":0}]
[null,null,null,null,null,null,null,null,null,null,null,null,null,null,null,{"$f":"J2258+O2258","v":0}]
[null,null,null,null,null,null,null,null,null,null,null,null,null,null,null,{"$f":"J2259+O2259","v":0}]
[null,null,null,null,null,null,null,null,null,null,null,null,null,null,null,{"$f":"J2260+O2260","v":0}]
[null,null,null,null,null,null,null,null,null,null,null,null,null,null,null,{"$f":"J2261+O2261","v":0}]
[null,null,null,null,null,null,null,null,null,null,null,null,null,null,null,{"$f":"J2262+O2262","v":0}]
[null,null,null,null,null,null,null,null,null,null,null,null,null,null,null,{"$f":"J2263+O2263","v":0}]
[null,null,null,null,null,null,null,null,null,null,null,null,null,null,null,{"$f":"J2264+O2264","v":0}]
[null,null,null,null,null,null,null,null,null,null,null,null,null,null,null,{"$f":"J2265+O2265","v":0}]
[null,null,null,null,null,null,null,null,null,null,null,null,null,null,null,{"$f":"J2266+O2266","v":0}]
[null,null,null,null,null,null,null,null,null,null,null,null,null,null,null,{"$f":"J2267+O2267","v":0}]
[null,null,null,null,null,null,null,null,null,null,null,null,null,null,null,{"$f":"J2268+O2268","v":0}]
[null,null,null,null,null,null,null,null,null,null,null,null,null,null,null,{"$f":"J2269+O2269","v":0}]
[null,null,null,null,null,null,null,null,null,null,null,null,null,null,null,{"$f":"J2270+O2270","v":0}]
[null,null,null,null,null,null,null,null,null,null,null,null,null,null,null,{"$f":"J2271+O2271","v":0}]
[null,null,null,null,null,null,null,null,null,null,null,null,null,null,null,{"$f":"J2272+O2272","v":0}]
[null,null,null,null,null,null,null,null,null,null,null,null,null,null,null,{"$f":"J2273+O2273","v":0}]
[null,null,null,null,null,null,null,null,null,null,null,null,null,null,null,{"$f":"J2274+O2274","v":0}]
[null,null,null,null,null,null,null,null,null,null,null,null,null,null,null,{"$f":"J2275+O2275","v":0}]
[null,null,null,null,null,null,null,null,null,null,null,null,null,null,null,{"$f":"J2276+O2276","v":0}]
[null,null,null,null,null,null,null,null,null,null,null,null,null,null,null,{"$f":"J2277+O2277","v":0}]
[null,null,null,null,null,null,null,null,null,null,null,null,null,null,null,{"$f":"J2278+O2278","v":0}]
[null,null,null,null,null,null,null,null,null,null,null,null,null,null,null,{"$f":"J2279+O2279","v":0}]
[null,null,null,null,null,null,null,null,null,null,null,null,null,null,null,{"$f":"J2280+O2280","v":0}]
[null,null,null,null,null,null,null,null,null,null,null,null,null,null,null,{"$f":"J2281+O2281","v":0}]
[null,null,null,null,null,null,null,null,null,null,null,null,null,null,null,{"$f":"J2282+O2282","v":0}]
[null,null,null,null,null,null,null,null,null,null,null,null,null,null,null,{"$f":"J2283+O2283","v":0}]
[null,null,null,null,null,null,null,null,null,null,null,null,null,null,null,{"$f":"J2284+O2284","v":0}]
[null,null,null,null,null,null,null,null,null,null,null,null,null,null,null,{"$f":"J2285+O2285","v":0}]
[null,null,null,null,null,null,null,null,null,null,null,null,null,null,null,{"$f":"J2286+O2286","v":0}]
[null,null,null,null,null,null,null,null,null,null,null,null,null,null,null,{"$f":"J2287+O2287","v":0}]
[null,null,null,null,null,null,null,null,null,null,null,null,null,null,null,{"$f":"J2288+O2288","v":0}]
[null,null,null,null,null,null,null,null,null,null,null,null,null,null,null,{"$f":"J2289+O2289","v":0}]
[null,null,null,null,null,null,null,null,null,null,null,null,null,null,null,{"$f":"J2290+O2290","v":0}]
[null,null,null,null,null,null,null,null,null,null,null,null,null,null,null,{"$f":"J2291+O2291","v":0}]
[null,null,null,null,null,null,null,null,null,null,null,null,null,null,null,{"$f":"J2292+O2292","v":0}]
[null,null,null,null,null,null,null,null,null,null,null,null,null,null,null,{"$f":"J2293+O2293","v":0}]
[null,null,null,null,null,null,null,null,null,null,null,null,null,null,null,{"$f":"J2294+O2294","v":0}]
[null,null,null,null,null,null,null,null,null,null,null,null,null,null,null,{"$f":"J2295+O2295","v":0}]
[null,null,null,null,null,null,null,null,null,null,null,null,null,null,null,{"$f":"J2296+O2296","v":0}]
[null,null,null,null,null,null,null,null,null,null,null,null,null,null,null,{"$f":"J2297+O2297","v":0}]
[null,null,null,null,null,null,null,null,null,null,null,null,null,null,null,{"$f":"J2298+O2298","v":0}]
[null,null,null,null,null,null,null,null,null,null,null,null,null,null,null,{"$f":"J2299+O2299","v":0}]
[null,null,null,null,null,null,null,null,null,null,null,null,null,null,null,{"$f":"J2300+O2300","v":0}]
[null,null,null,null,null,null,null,null,null,null,null,null,null,null,null,{"$f":"J2301+O2301","v":0}]
[null,null,null,null,null,null,null,null,null,null,null,null,null,null,null,{"$f":"J2302+O2302","v":0}]
[null,null,null,null,null,null,null,null,null,null,null,null,null,null,null,{"$f":"J2303+O2303","v":0}]
[null,null,null,null,null,null,null,null,null,null,null,null,null,null,null,{"$f":"J2304+O2304","v":0}]
[null,null,null,null,null,null,null,null,null,null,null,null,null,null,null,{"$f":"J2305+O2305","v":0}]
[null,null,null,null,null,null,null,null,null,null,null,null,null,null,null,{"$f":"J2306+O2306","v":0}]
[null,null,null,null,null,null,null,null,null,null,null,null,null,null,null,{"$f":"J2307+O2307","v":0}]
[null,null,null,null,null,null,null,null,null,null,null,null,null,null,null,{"$f":"J2308+O2308","v":0}]
[null,null,null,null,null,null,null,null,null,null,null,null,null,null,null,{"$f":"J2309+O2309","v":0}]
[null,null,null,null,null,null,null,null,null,null,null,null,null,null,null,{"$f":"J2310+O2310","v":0}]
[null,null,null,null,null,null,null,null,null,null,null,null,null,null,null,{"$f":"J2311+O2311","v":0}]
[null,null,null,null,null,null,null,null,null,null,null,null,null,null,null,{"$f":"J2312+O2312","v":0}]
[null,null,null,null,null,null,null,null,null,null,null,null,null,null,null,{"$f":"J2313+O2313","v":0}]
[null,null,null,null,null,null,null,null,null,null,null,null,null,null,null,{"$f":"J2314+O2314","v":0}]
[null,null,null,null,null,null,null,null,null,null,null,null,null,null,null,{"$f":"J2315+O2315","v":0}]
[null,null,null,null,null,null,null,null,null,null,null,null,null,null,null,{"$f":"J2316+O2316","v":0}]
[null,null,null,null,null,null,null,null,null,null,null,null,null,null,null,{"$f":"J2317+O2317","v":0}]
[null,null,null,null,null,null,null,null,null,null,null,null,null,null,null,{"$f":"J2318+O2318","v":0}]
[null,null,null,null,null,null,null,null,null,null,null,null,null,null,null,{"$f":"J2319+O2319","v":0}]
[null,null,null,null,null,null,null,null,null,null,null,null,null,null,null,{"$f":"J2320+O2320","v":0}]
[null,null,null,null,null,null,null,null,null,null,null,null,null,null,null,{"$f":"J2321+O2321","v":0}]
[null,null,null,null,null,null,null,null,null,null,null,null,null,null,null,{"$f":"J2322+O2322","v":0}]
[null,null,null,null,null,null,null,null,null,null,null,null,null,null,null,{"$f":"J2323+O2323","v":0}]
[null,null,null,null,null,null,null,null,null,null,null,null,null,null,null,{"$f":"J2324+O2324","v":0}]
[null,null,null,null,null,null,null,null,null,null,null,null,null,null,null,{"$f":"J2325+O2325","v":0}]
[null,null,null,null,null,null,null,null,null,null,null,null,null,null,null,{"$f":"J2326+O2326","v":0}]
[null,null,null,null,null,null,null,null,null,null,null,null,null,null,null,{"$f":"J2327+O2327","v":0}]
[null,null,null,null,null,null,null,null,null,null,null,null,null,null,null,{"$f":"J2328+O2328","v":0}]
[null,null,null,null,null,null,null,null,null,null,null,null,null,null,null,{"$f":"J2329+O2329","v":0}]
[null,null,null,null,null,null,null,null,null,null,null,null,null,null,null,{"$f":"J2330+O2330","v":0}]
[null,null,null,null,null,null,null,null,null,null,null,null,null,null,null,{"$f":"J2331+O2331","v":0}]
[null,null,null,null,null,null,null,null,null,null,null,null,null,null,null,{"$f":"J2332+O2332","v":0}]
[null,null,null,null,null,null,null,null,null,null,null,null,null,null,null,{"$f":"J2333+O2333","v":0}]
[null,null,null,null,null,null,null,null,null,null,null,null,null,null,null,{"$f":"J2334+O2334","v":0}]
[null,null,null,null,null,null,null,null,null,null,null,null,null,null,null,{"$f":"J2335+O2335","v":0}]
[null,null,null,null,null,null,null,null,null,null,null,null,null,null,null,{"$f":"J2336+O2336","v":0}]
[null,null,null,null,null,null,null,null,null,null,null,null,null,null,null,{"$f":"J2337+O2337","v":0}]
[null,null,null,null,null,null,null,null,null,null,null,null,null,null,null,{"$f":"J2338+O2338","v":0}]
[null,null,null,null,null,null,null,null,null,null,null,null,null,null,null,{"$f":"J2339+O2339","v":0}]
[null,null,null,null,null,null,null,null,null,null,null,null,null,null,null,{"$f":"J2340+O2340","v":0}]
[null,null,null,null,null,null,null,null,null,null,null,null,null,null,null,{"$f":"J2341+O2341","v":0}]
[null,null,null,null,null,null,null,null,null,null,null,null,null,null,null,{"$f":"J2342+O2342","v":0}]
[null,null,null,null,null,null,null,null,null,null,null,null,null,null,null,{"$f":"J2343+O2343","v":0}]
[null,null,null,null,null,null,null,null,null,null,null,null,null,null,null,{"$f":"J2344+O2344","v":0}]
[null,null,null,null,null,null,null,null,null,null,null,null,null,null,null,{"$f":"J2345+O2345","v":0}]
[null,null,null,null,null,null,null,null,null,null,null,null,null,null,null,{"$f":"J2346+O2346","v":0}]
[null,null,null,null,null,null,null,null,null,null,null,null,null,null,null,{"$f":"J2347+O2347","v":0}]
[null,null,null,null,null,null,null,null,null,null,null,null,null,null,null,{"$f":"J2348+O2348","v":0}]
[null,null,null,null,null,null,null,null,null,null,null,null,null,null,null,{"$f":"J2349+O2349","v":0}]
[null,null,null,null,null,null,null,null,null,null,null,null,null,null,null,{"$f":"J2350+O2350","v":0}]
[null,null,null,null,null,null,null,null,null,null,null,null,null,null,null,{"$f":"J2351+O2351","v":0}]
[null,null,null,null,null,null,null,null,null,null,null,null,null,null,null,{"$f":"J2352+O2352","v":0}]
[null,null,null,null,null,null,null,null,null,null,null,null,null,null,null,{"$f":"J2353+O2353","v":0}]
[null,null,null,null,null,null,null,null,null,null,null,null,null,null,null,{"$f":"J2354+O2354","v":0}]
[null,null,null,null,null,null,null,null,null,null,null,null,null,null,null,{"$f":"J2355+O2355","v":0}]
[null,null,null,null,null,null,null,null,null,null,null,null,null,null,null,{"$f":"J2356+O2356","v":0}]
[null,null,null,null,null,null,null,null,null,null,null,null,null,null,null,{"$f":"J2357+O2357","v":0}]
[null,null,null,null,null,null,null,null,null,null,null,null,null,null,null,{"$f":"J2358+O2358","v":0}]
[null,null,null,null,null,null,null,null,null,null,null,null,null,null,null,{"$f":"J2359+O2359","v":0}]
[null,null,null,null,null,null,null,null,null,null,null,null,null,null,null,{"$f":"J2360+O2360","v":0}]
[null,null,null,null,null,null,null,null,null,null,null,null,null,null,null,{"$f":"J2361+O2361","v":0}]
[null,null,null,null,null,null,null,null,null,null,null,null,null,null,null,{"$f":"J2362+O2362","v":0}]
[null,null,null,null,null,null,null,null,null,null,null,null,null,null,null,{"$f":"J2363+O2363","v":0}]
[null,null,null,null,null,null,null,null,null,null,null,null,null,null,null,{"$f":"J2364+O2364","v":0}]
[null,null,null,null,null,null,null,null,null,null,null,null,null,null,null,{"$f":"J2365+O2365","v":0}]
[null,null,null,null,null,null,null,null,null,null,null,null,null,null,null,{"$f":"J2366+O2366","v":0}]
[null,null,null,null,null,null,null,null,null,null,null,null,null,null,null,{"$f":"J2367+O2367","v":0}]
[null,null,null,null,null,null,null,null,null,null,null,null,null,null,null,{"$f":"J2368+O2368","v":0}]
[null,null,null,null,null,null,null,null,null,null,null,null,null,null,null,{"$f":"J2369+O2369","v":0}]
[null,null,null,null,null,null,null,null,null,null,null,null,null,null,null,{"$f":"J2370+O2370","v":0}]
[null,null,null,null,null,null,null,null,null,null,null,null,null,null,null,{"$f":"J2371+O2371","v":0}]
[null,null,null,null,null,null,null,null,null,null,null,null,null,null,null,{"$f":"J2372+O2372","v":0}]
[null,null,null,null,null,null,null,null,null,null,null,null,null,null,null,{"$f":"J2373+O2373","v":0}]
[null,null,null,null,null,null,null,null,null,null,null,null,null,null,null,{"$f":"J2374+O2374","v":0}]
[null,null,null,null,null,null,null,null,null,null,null,null,null,null,null,{"$f":"J2375+O2375","v":0}]
[null,null,null,null,null,null,null,null,null,null,null,null,null,null,null,{"$f":"J2376+O2376","v":0}]
[null,null,null,null,null,null,null,null,null,null,null,null,null,null,null,{"$f":"J2377+O2377","v":0}]
[null,null,null,null,null,null,null,null,null,null,null,null,null,null,null,{"$f":"J2378+O2378","v":0}]
[null,null,null,null,null,null,null,null,null,null,null,null,null,null,null,{"$f":"J2379+O2379","v":0}]
[null,null,null,null,null,null,null,null,null,null,null,null,null,null,null,{"$f":"J2380+O2380","v":0}]
[null,null,null,null,null,null,null,null,null,null,null,null,null,null,null,{"$f":"J2381+O2381","v":0}]
[null,null,null,null,null,null,null,null,null,null,null,null,null,null,null,{"$f":"J2382+O2382","v":0}]
[null,null,null,null,null,null,null,null,null,null,null,null,null,null,null,{"$f":"J2383+O2383","v":0}]
[null,null,null,null,null,null,null,null,null,null,null,null,null,null,null,{"$f":"J2384+O2384","v":0}]
[null,null,null,null,null,null,null,null,null,null,null,null,null,null,null,{"$f":"J2385+O2385","v":0}]
[null,null,null,null,null,null,null,null,null,null,null,null,null,null,null,{"$f":"J2386+O2386","v":0}]
[null,null,null,null,null,null,null,null,null,null,null,null,null,null,null,{"$f":"J2387+O2387","v":0}]
[null,null,null,null,null,null,null,null,null,null,null,null,null,null,null,{"$f":"J2388+O2388","v":0}]
[null,null,null,null,null,null,null,null,null,null,null,null,null,null,null,{"$f":"J2389+O2389","v":0}]
[null,null,null,null,null,null,null,null,null,null,null,null,null,null,null,{"$f":"J2390+O2390","v":0}]
[null,null,null,null,null,null,null,null,null,null,null,null,null,null,null,{"$f":"J2391+O2391","v":0}]
[null,null,null,null,null,null,null,null,null,null,null,null,null,null,null,{"$f":"J2392+O2392","v":0}]
[null,null,null,null,null,null,null,null,null,null,null,null,null,null,null,{"$f":"J2393+O2393","v":0}]
[null,null,null,null,null,null,null,null,null,null,null,null,null,null,null,{"$f":"J2394+O2394","v":0}]
[null,null,null,null,null,null,null,null,null,null,null,null,null,null,null,{"$f":"J2395+O2395","v":0}]
[null,null,null,null,null,null,null,null,null,null,null,null,null,null,null,{"$f":"J2396+O2396","v":0}]
[null,null,null,null,null,null,null,null,null,null,null,null,null,null,null,{"$f":"J2397+O2397","v":0}]
[null,null,null,null,null,null,null,null,null,null,null,null,null,null,null,{"$f":"J2398+O2398","v":0}]
[null,null,null,null,null,null,null,null,null,null,null,null,null,null,null,{"$f":"J2399+O2399","v":0}]
[null,null,null,null,null,null,null,null,null,null,null,null,null,null,null,{"$f":"J2400+O2400","v":0}]
[null,null,null,null,null,null,null,null,null,null,null,null,null,null,null,{"$f":"J2401+O2401","v":0}]
[null,null,null,null,null,null,null,null,null,null,null,null,null,null,null,{"$f":"J2402+O2402","v":0}]
[null,null,null,null,null,null,null,null,null,null,null,null,null,null,null,{"$f":"J2403+O2403","v":0}]
[null,null,null,null,null,null,null,null,null,null,null,null,null,null,null,{"$f":"J2404+O2404","v":0}]
[null,null,null,null,null,null,null,null,null,null,null,null,null,null,null,{"$f":"J2405+O2405","v":0}]
[null,null,null,null,null,null,null,null,null,null,null,null,null,null,null,{"$f":"J2406+O2406","v":0}]
[null,null,null,null,null,null,null,null,null,null,null,null,null,null,null,{"$f":"J2407+O2407","v":0}]
[null,null,null,null,null,null,null,null,null,null,null,null,null,null,null,{"$f":"J2408+O2408","v":0}]
[null,null,null,null,null,null,null,null,null,null,null,null,null,null,null,{"$f":"J2409+O2409","v":0}]
[null,null,null,null,null,null,null,null,null,null,null,null,null,null,null,{"$f":"J2410+O2410","v":0}]
[null,null,null,null,null,null,null,null,null,null,null,null,null,null,null,{"$f":"J2411+O2411","v":0}]
[null,null,null,null,null,null,null,null,null,null,null,null,null,null,null,{"$f":"J2412+O2412","v":0}]
[null,null,null,null,null,null,null,null,null,null,null,null,null,null,null,{"$f":"J2413+O2413","v":0}]
[null,null,null,null,null,null,null,null,null,null,null,null,null,null,null,{"$f":"J2414+O2414","v":0}]
[null,null,null,null,null,null,null,null,null,null,null,null,null,null,null,{"$f":"J2415+O2415","v":0}]
[null,null,null,null,null,null,null,null,null,null,null,null,null,null,null,{"$f":"J2416+O2416","v":0}]
[null,null,null,null,null,null,null,null,null,null,null,null,null,null,null,{"$f":"J2417+O2417","v":0}]
[null,null,null,null,null,null,null,null,null,null,null,null,null,null,null,{"$f":"J2418+O2418","v":0}]
[null,null,null,null,null,null,null,null,null,null,null,null,null,null,null,{"$f":"J2419+O2419","v":0}]
[null,null,null,null,null,null,null,null,null,null,null,null,null,null,null,{"$f":"J2420+O2420","v":0}]
[null,null,null,null,null,null,null,null,null,null,null,null,null,null,null,{"$f":"J2421+O2421","v":0}]
[null,null,null,null,null,null,null,null,null,null,null,null,null,null,null,{"$f":"J2422+O2422","v":0}]
[null,null,null,null,null,null,null,null,null,null,null,null,null,null,null,{"$f":"J2423+O2423","v":0}]
[null,null,null,null,null,null,null,null,null,null,null,null,null,null,null,{"$f":"J2424+O2424","v":0}]
[null,null,null,null,null,null,null,null,null,null,null,null,null,null,null,{"$f":"J2425+O2425","v":0}]
[null,null,null,null,null,null,null,null,null,null,null,null,null,null,null,{"$f":"J2426+O2426","v":0}]
[null,null,null,null,null,null,null,null,null,null,null,null,null,null,null,{"$f":"J2427+O2427","v":0}]
[null,null,null,null,null,null,null,null,null,null,null,null,null,null,null,{"$f":"J2428+O2428","v":0}]
[null,null,null,null,null,null,null,null,null,null,null,null,null,null,null,{"$f":"J2429+O2429","v":0}]
[null,null,null,null,null,null,null,null,null,null,null,null,null,null,null,{"$f":"J2430+O2430","v":0}]
[null,null,null,null,null,null,null,null,null,null,null,null,null,null,null,{"$f":"J2431+O2431","v":0}]
[null,null,null,null,null,null,null,null,null,null,null,null,null,null,null,{"$f":"J2432+O2432","v":0}]
[null,null,null,null,null,null,null,null,null,null,null,null,null,null,null,{"$f":"J2433+O2433","v":0}]
[null,null,null,null,null,null,null,null,null,null,null,null,null,null,null,{"$f":"J2434+O2434","v":0}]
[null,null,null,null,null,null,null,null,null,null,null,null,null,null,null,{"$f":"J2435+O2435","v":0}]
[null,null,null,null,null,null,null,null,null,null,null,null,null,null,null,{"$f":"J2436+O2436","v":0}]
[null,null,null,null,null,null,null,null,null,null,null,null,null,null,null,{"$f":"J2437+O2437","v":0}]
[null,null,null,null,null,null,null,null,null,null,null,null,null,null,null,{"$f":"J2438+O2438","v":0}]
[null,null,null,null,null,null,null,null,null,null,null,null,null,null,null,{"$f":"J2439+O2439","v":0}]
[null,null,null,null,null,null,null,null,null,null,null,null,null,null,null,{"$f":"J2440+O2440","v":0}]
[null,null,null,null,null,null,null,null,null,null,null,null,null,null,null,{"$f":"J2441+O2441","v":0}]
[null,null,null,null,null,null,null,null,null,null,null,null,null,null,null,{"$f":"J2442+O2442","v":0}]
[null,null,null,null,null,null,null,null,null,null,null,null,null,null,null,{"$f":"J2443+O2443","v":0}]
[null,null,null,null,null,null,null,null,null,null,null,null,null,null,null,{"$f":"J2444+O2444","v":0}]
[null,null,null,null,null,null,null,null,null,null,null,null,null,null,null,{"$f":"J2445+O2445","v":0}]
[null,null,null,null,null,null,null,null,null,null,null,null,null,null,null,{"$f":"J2446+O2446","v":0}]
[null,null,null,null,null,null,null,null,null,null,null,null,null,null,null,{"$f":"J2447+O2447","v":0}]
[null,null,null,null,null,null,null,null,null,null,null,null,null,null,null,{"$f":"J2448+O2448","v":0}]
[null,null,null,null,null,null,null,null,null,null,null,null,null,null,null,{"$f":"J2449+O2449","v":0}]
[null,null,null,null,null,null,null,null,null,null,null,null,null,null,null,{"$f":"J2450+O2450","v":0}]
[null,null,null,null,null,null,null,null,null,null,null,null,null,null,null,{"$f":"J2451+O2451","v":0}]
[null,null,null,null,null,null,null,null,null,null,null,null,null,null,null,{"$f":"J2452+O2452","v":0}]
[null,null,null,null,null,null,null,null,null,null,null,null,null,null,null,{"$f":"J2453+O2453","v":0}]
[null,null,null,null,null,null,null,null,null,null,null,null,null,null,null,{"$f":"J2454+O2454","v":0}]
[null,null,null,null,null,null,null,null,null,null,null,null,null,null,null,{"$f":"J2455+O2455","v":0}]
[null,null,null,null,null,null,null,null,null,null,null,null,null,null,null,{"$f":"J2456+O2456","v":0}]
[null,null,null,null,null,null,null,null,null,null,null,null,null,null,null,{"$f":"J2457+O2457","v":0}]
[null,null,null,null,null,null,null,null,null,null,null,null,null,null,null,{"$f":"J2458+O2458","v":0}]
[null,null,null,null,null,null,null,null,null,null,null,null,null,null,null,{"$f":"J2459+O2459","v":0}]
[null,null,null,null,null,null,null,null,null,null,null,null,null,null,null,{"$f":"J2460+O2460","v":0}]
[null,null,null,null,null,null,null,null,null,null,null,null,null,null,null,{"$f":"J2461+O2461","v":0}]
[null,null,null,null,null,null,null,null,null,null,null,null,null,null,null,{"$f":"J2462+O2462","v":0}]
[null,null,null,null,null,null,null,null,null,null,null,null,null,null,null,{"$f":"J2463+O2463","v":0}]
[null,null,null,null,null,null,null,null,null,null,null,null,null,null,null,{"$f":"J2464+O2464","v":0}]
[null,null,null,null,null,null,null,null,null,null,null,null,null,null,null,{"$f":"J2465+O2465","v":0}]
[null,null,null,null,null,null,null,null,null,null,null,null,null,null,null,{"$f":"J2466+O2466","v":0}]
[null,null,null,null,null,null,null,null,null,null,null,null,null,null,null,{"$f":"J2467+O2467","v":0}]
[null,null,null,null,null,null,null,null,null,null,null,null,null,null,null,{"$f":"J2468+O2468","v":0}]
[null,null,null,null,null,null,null,null,null,null,null,null,null,null,null,{"$f":"J2469+O2469","v":0}]
[null,null,null,null,null,null,null,null,null,null,null,null,null,null,null,{"$f":"J2470+O2470","v":0}]
[null,null,null,null,null,null,null,null,null,null,null,null,null,null,null,{"$f":"J2471+O2471","v":0}]
[null,null,null,null,null,null,null,null,null,null,null,null,null,null,null,{"$f":"J2472+O2472","v":0}]
[null,null,null,null,null,null,null,null,null,null,null,null,null,null,null,{"$f":"J2473+O2473","v":0}]
[null,null,null,null,null,null,null,null,null,null,null,null,null,null,null,{"$f":"J2474+O2474","v":0}]
[null,null,null,null,null,null,null,null,null,null,null,null,null,null,null,{"$f":"J2475+O2475","v":0}]
[null,null,null,null,null,null,null,null,null,null,null,null,null,null,null,{"$f":"J2476+O2476","v":0}]
[null,null,null,null,null,null,null,null,null,null,null,null,null,null,null,{"$f":"J2477+O2477","v":0}]
[null,null,null,null,null,null,null,null,null,null,null,null,null,null,null,{"$f":"J2478+O2478","v":0}]
[null,null,null,null,null,null,null,null,null,null,null,null,null,null,null,{"$f":"J2479+O2479","v":0}]
[null,null,null,null,null,null,null,null,null,null,null,null,null,null,null,{"$f":"J2480+O2480","v":0}]
[null,null,null,null,null,null,null,null,null,null,null,null,null,null,null,{"$f":"J2481+O2481","v":0}]
[null,null,null,null,null,null,null,null,null,null,null,null,null,null,null,{"$f":"J2482+O2482","v":0}]
[null,null,null,null,null,null,null,null,null,null,null,null,null,null,null,{"$f":"J2483+O2483","v":0}]
[null,null,null,null,null,null,null,null,null,null,null,null,null,null,null,{"$f":"J2484+O2484","v":0}]
[null,null,null,null,null,null,null,null,null,null,null,null,null,null,null,{"$f":"J2485+O2485","v":0}]
[null,null,null,null,null,null,null,null,null,null,null,null,null,null,null,{"$f":"J2486+O2486","v":0}]
[null,null,null,null,null,null,null,null,null,null,null,null,null,null,null,{"$f":"J2487+O2487","v":0}]
[null,null,null,null,null,null,null,null,null,null,null,null,null,null,null,{"$f":"J2488+O2488","v":0}]
[null,null,null,null,null,null,null,null,null,null,null,null,null,null,null,{"$f":"J2489+O2489","v":0}]
[null,null,null,null,null,null,null,null,null,null,null,null,null,null,null,{"$f":"J2490+O2490","v":0}]
[null,null,null,null,null,null,null,null,null,null,null,null,null,null,null,{"$f":"J2491+O2491","v":0}]
[null,null,null,null,null,null,null,null,null,null,null,null,null,null,null,{"$f":"J2492+O2492","v":0}]
[null,null,null,null,null,null,null,null,null,null,null,null,null,null,null,{"$f":"J2493+O2493","v":0}]
[null,null,null,null,null,null,null,null,null,null,null,null,null,null,null,{"$f":"J2494+O2494","v":0}]
[null,null,null,null,null,null,null,null,null,null,null,null,null,null,null,{"$f":"J2495+O2495","v":0}]
[null,null,null,null,null,null,null,null,null,null,null,null,null,null,null,{"$f":"J2496+O2496","v":0}]
[null,null,null,null,null,null,null,null,null,null,null,null,null,null,null,{"$f":"J2497+O2497","v":0}]
[null,null,null,null,null,null,null,null,null,null,null,null,null,null,null,{"$f":"J2498+O2498","v":0}]
[null,null,null,null,null,null,null,null,null,null,null,null,null,null,null,{"$f":"J2499+O2499","v":0}]
[null,null,null,null,null,null,null,null,null,null,null,null,null,null,null,{"$f":"J2500+O2500","v":0}]
[null,null,null,null,null,null,null,null,null,null,null,null,null,null,null,{"$f":"J2501+O2501","v":0}]
[null,null,null,null,null,null,null,null,null,null,null,null,null,null,null,{"$f":"J2502+O2502","v":0}]
[null,null,null,null,null,null,null,null,null,null,null,null,null,null,null,{"$f":"J2503+O2503","v":0}]
[null,null,null,null,null,null,null,null,null,null,null,null,null,null,null,{"$f":"J2504+O2504","v":0}]
[null,null,null,null,null,null,null,null,null,null,null,null,null,null,null,{"$f":"J2505+O2505","v":0}]
[null,null,null,null,null,null,null,null,null,null,null,null,null,null,null,{"$f":"J2506+O2506","v":0}]
[null,null,null,null,null,null,null,null,null,null,null,null,null,null,null,{"$f":"J2507+O2507","v":0}]
[null,null,null,null,null,null,null,null,null,null,null,null,null,null,null,{"$f":"J2508+O2508","v":0}]
[null,null,null,null,null,null,null,null,null,null,null,null,null,null,null,{"$f":"J2509+O2509","v":0}]
[null,null,null,null,null,null,null,null,null,null,null,null,null,null,null,{"$f":"J2510+O2510","v":0}]
[null,null,null,null,null,null,null,null,null,null,null,null,null,null,null,{"$f":"J2511+O2511","v":0}]
[null,null,null,null,null,null,null,null,null,null,null,null,null,null,null,{"$f":"J2512+O2512","v":0}]
[null,null,null,null,null,null,null,null,null,null,null,null,null,null,null,{"$f":"J2513+O2513","v":0}]
[null,null,null,null,null,null,null,null,null,null,null,null,null,null,null,{"$f":"J2514+O2514","v":0}]
[null,null,null,null,null,null,null,null,null,null,null,null,null,null,null,{"$f":"J2515+O2515","v":0}]
[null,null,null,null,null,null,null,null,null,null,null,null,null,null,null,{"$f":"J2516+O2516","v":0}]
[null,null,null,null,null,null,null,null,null,null,null,null,null,null,null,{"$f":"J2517+O2517","v":0}]
[null,null,null,null,null,null,null,null,null,null,null,null,null,null,null,{"$f":"J2518+O2518","v":0}]
[null,null,null,null,null,null,null,null,null,null,null,null,null,null,null,{"$f":"J2519+O2519","v":0}]
[null,null,null,null,null,null,null,null,null,null,null,null,null,null,null,{"$f":"J2520+O2520","v":0}]
[null,null,null,null,null,null,null,null,null,null,null,null,null,null,null,{"$f":"J2521+O2521","v":0}]
[null,null,null,null,null,null,null,null,null,null,null,null,null,null,null,{"$f":"J2522+O2522","v":0}]
[null,null,null,null,null,null,null,null,null,null,null,null,null,null,null,{"$f":"J2523+O2523","v":0}]
[null,null,null,null,null,null,null,null,null,null,null,null,null,null,null,{"$f":"J2524+O2524","v":0}]
[null,null,null,null,null,null,null,null,null,null,null,null,null,null,null,{"$f":"J2525+O2525","v":0}]
[null,null,null,null,null,null,null,null,null,null,null,null,null,null,null,{"$f":"J2526+O2526","v":0}]
[null,null,null,null,null,null,null,null,null,null,null,null,null,null,null,{"$f":"J2527+O2527","v":0}]
[null,null,null,null,null,null,null,null,null,null,null,null,null,null,null,{"$f":"J2528+O2528","v":0}]
[null,null,null,null,null,null,null,null,null,null,null,null,null,null,null,{"$f":"J2529+O2529","v":0}]
[null,null,null,null,null,null,null,null,null,null,null,null,null,null,null,{"$f":"J2530+O2530","v":0}]
[null,null,null,null,null,null,null,null,null,null,null,null,null,null,null,{"$f":"J2531+O2531","v":0}]
[null,null,null,null,null,null,null,null,null,null,null,null,null,null,null,{"$f":"J2532+O2532","v":0}]
[null,null,null,null,null,null,null,null,null,null,null,null,null,null,null,{"$f":"J2533+O2533","v":0}]
[null,null,null,null,null,null,null,null,null,null,null,null,null,null,null,{"$f":"J2534+O2534","v":0}]
[null,null,null,null,null,null,null,null,null,null,null,null,null,null,null,{"$f":"J2535+O2535","v":0}]
[null,null,null,null,null,null,null,null,null,null,null,null,null,null,null,{"$f":"J2536+O2536","v":0}]
[null,null,null,null,null,null,null,null,null,null,null,null,null,null,null,{"$f":"J2537+O2537","v":0}]
[null,null,null,null,null,null,null,null,null,null,null,null,null,null,null,{"$f":"J2538+O2538","v":0}]
[null,null,null,null,null,null,null,null,null,null,null,null,null,null,null,{"$f":"J2539+O2539","v":0}]
[null,null,null,null,null,null,null,null,null,null,null,null,null,null,null,{"$f":"J2540+O2540","v":0}]
[null,null,null,null,null,null,null,null,null,null,null,null,null,null,null,{"$f":"J2541+O2541","v":0}]
[null,null,null,null,null,null,null,null,null,null,null,null,null,null,null,{"$f":"J2542+O2542","v":0}]
[null,null,null,null,null,null,null,null,null,null,null,null,null,null,null,{"$f":"J2543+O2543","v":0}]
[null,null,null,null,null,null,null,null,null,null,null,null,null,null,null,{"$f":"J2544+O2544","v":0}]
[null,null,null,null,null,null,null,null,null,null,null,null,null,null,null,{"$f":"J2545+O2545","v":0}]
[null,null,null,null,null,null,null,null,null,null,null,null,null,null,null,{"$f":"J2546+O2546","v":0}]
[null,null,null,null,null,null,null,null,null,null,null,null,null,null,null,{"$f":"J2547+O2547","v":0}]
[null,null,null,null,null,null,null,null,null,null,null,null,null,null,null,{"$f":"J2548+O2548","v":0}]
[null,null,null,null,null,null,null,null,null,null,null,null,null,null,null,{"$f":"J2549+O2549","v":0}]
[null,null,null,null,null,null,null,null,null,null,null,null,null,null,null,{"$f":"J2550+O2550","v":0}]
[null,null,null,null,null,null,null,null,null,null,null,null,null,null,null,{"$f":"J2551+O2551","v":0}]
[null,null,null,null,null,null,null,null,null,null,null,null,null,null,null,{"$f":"J2552+O2552","v":0}]
[null,null,null,null,null,null,null,null,null,null,null,null,null,null,null,{"$f":"J2553+O2553","v":0}]
[null,null,null,null,null,null,null,null,null,null,null,null,null,null,null,{"$f":"J2554+O2554","v":0}]
[null,null,null,null,null,null,null,null,null,null,null,null,null,null,null,{"$f":"J2555+O2555","v":0}]
[null,null,null,null,null,null,null,null,null,null,null,null,null,null,null,{"$f":"J2556+O2556","v":0}]
[null,null,null,null,null,null,null,null,null,null,null,null,null,null,null,{"$f":"J2557+O2557","v":0}]
[null,null,null,null,null,null,null,null,null,null,null,null,null,null,null,{"$f":"J2558+O2558","v":0}]
[null,null,null,null,null,null,null,null,null,null,null,null,null,null,null,{"$f":"J2559+O2559","v":0}]
[null,null,null,null,null,null,null,null,null,null,null,null,null,null,null,{"$f":"J2560+O2560","v":0}]
[null,null,null,null,null,null,null,null,null,null,null,null,null,null,null,{"$f":"J2561+O2561","v":0}]
[null,null,null,null,null,null,null,null,null,null,null,null,null,null,null,{"$f":"J2562+O2562","v":0}]
[null,null,null,null,null,null,null,null,null,null,null,null,null,null,null,{"$f":"J2563+O2563","v":0}]
[null,null,null,null,null,null,null,null,null,null,null,null,null,null,null,{"$f":"J2564+O2564","v":0}]
[null,null,null,null,null,null,null,null,null,null,null,null,null,null,null,{"$f":"J2565+O2565","v":0}]
[null,null,null,null,null,null,null,null,null,null,null,null,null,null,null,{"$f":"J2566+O2566","v":0}]
[null,null,null,null,null,null,null,null,null,null,null,null,null,null,null,{"$f":"J2567+O2567","v":0}]
[null,null,null,null,null,null,null,null,null,null,null,null,null,null,null,{"$f":"J2568+O2568","v":0}]
[null,null,null,null,null,null,null,null,null,null,null,null,null,null,null,{"$f":"J2569+O2569","v":0}]
[null,null,null,null,null,null,null,null,null,null,null,null,null,null,null,{"$f":"J2570+O2570","v":0}]
[null,null,null,null,null,null,null,null,null,null,null,null,null,null,null,{"$f":"J2571+O2571","v":0}]
[null,null,null,null,null,null,null,null,null,null,null,null,null,null,null,{"$f":"J2572+O2572","v":0}]
[null,null,null,null,null,null,null,null,null,null,null,null,null,null,null,{"$f":"J2573+O2573","v":0}]
[null,null,null,null,null,null,null,null,null,null,null,null,null,null,null,{"$f":"J2574+O2574","v":0}]
[null,null,null,null,null,null,null,null,null,null,null,null,null,null,null,{"$f":"J2575+O2575","v":0}]
[null,null,null,null,null,null,null,null,null,null,null,null,null,null,null,{"$f":"J2576+O2576","v":0}]
[null,null,null,null,null,null,null,null,null,null,null,null,null,null,null,{"$f":"J2577+O2577","v":0}]
[null,null,null,null,null,null,null,null,null,null,null,null,null,null,null,{"$f":"J2578+O2578","v":0}]
[null,null,null,null,null,null,null,null,null,null,null,null,null,null,null,{"$f":"J2579+O2579","v":0}]
[null,null,null,null,null,null,null,null,null,null,null,null,null,null,null,{"$f":"J2580+O2580","v":0}]
[null,null,null,null,null,null,null,null,null,null,null,null,null,null,null,{"$f":"J2581+O2581","v":0}]
[null,null,null,null,null,null,null,null,null,null,null,null,null,null,null,{"$f":"J2582+O2582","v":0}]
[null,null,null,null,null,null,null,null,null,null,null,null,null,null,null,{"$f":"J2583+O2583","v":0}]
[null,null,null,null,null,null,null,null,null,null,null,null,null,null,null,{"$f":"J2584+O2584","v":0}]
[null,null,null,null,null,null,null,null,null,null,null,null,null,null,null,{"$f":"J2585+O2585","v":0}]
[null,null,null,null,null,null,null,null,null,null,null,null,null,null,null,{"$f":"J2586+O2586","v":0}]
[null,null,null,null,null,null,null,null,null,null,null,null,null,null,null,{"$f":"J2587+O2587","v":0}]
[null,null,null,null,null,null,null,null,null,null,null,null,null,null,null,{"$f":"J2588+O2588","v":0}]
[null,null,null,null,null,null,null,null,null,null,null,null,null,null,null,{"$f":"J2589+O2589","v":0}]
[null,null,null,null,null,null,null,null,null,null,null,null,null,null,null,{"$f":"J2590+O2590","v":0}]
[null,null,null,null,null,null,null,null,null,null,null,null,null,null,null,{"$f":"J2591+O2591","v":0}]
[null,null,null,null,null,null,null,null,null,null,null,null,null,null,null,{"$f":"J2592+O2592","v":0}]
[null,null,null,null,null,null,null,null,null,null,null,null,null,null,null,{"$f":"J2593+O2593","v":0}]
[null,null,null,null,null,null,null,null,null,null,null,null,null,null,null,{"$f":"J2594+O2594","v":0}]
[null,null,null,null,null,null,null,null,null,null,null,null,null,null,null,{"$f":"J2595+O2595","v":0}]
[null,null,null,null,null,null,null,null,null,null,null,null,null,null,null,{"$f":"J2596+O2596","v":0}]
[null,null,null,null,null,null,null,null,null,null,null,null,null,null,null,{"$f":"J2597+O2597","v":0}]
[null,null,null,null,null,null,null,null,null,null,null,null,null,null,null,{"$f":"J2598+O2598","v":0}]
[null,null,null,null,null,null,null,null,null,null,null,null,null,null,null,{"$f":"J2599+O2599","v":0}]
[null,null,null,null,null,null,null,null,null,null,null,null,null,null,null,{"$f":"J2600+O2600","v":0}]
[null,null,null,null,null,null,null,null,null,null,null,null,null,null,null,{"$f":"J2601+O2601","v":0}]
[null,null,null,null,null,null,null,null,null,null,null,null,null,null,null,{"$f":"J2602+O2602","v":0}]
[null,null,null,null,null,null,null,null,null,null,null,null,null,null,null,{"$f":"J2603+O2603","v":0}]
[null,null,null,null,null,null,null,null,null,null,null,null,null,null,null,{"$f":"J2604+O2604","v":0}]
[null,null,null,null,null,null,null,null,null,null,null,null,null,null,null,{"$f":"J2605+O2605","v":0}]
[null,null,null,null,null,null,null,null,null,null,null,null,null,null,null,{"$f":"J2606+O2606","v":0}]
[null,null,null,null,null,null,null,null,null,null,null,null,null,null,null,{"$f":"J2607+O2607","v":0}]
[null,null,null,null,null,null,null,null,null,null,null,null,null,null,null,{"$f":"J2608+O2608","v":0}]
[null,null,null,null,null,null,null,null,null,null,null,null,null,null,null,{"$f":"J2609+O2609","v":0}]
[null,null,null,null,null,null,null,null,null,null,null,null,null,null,null,{"$f":"J2610+O2610","v":0}]
[null,null,null,null,null,null,null,null,null,null,null,null,null,null,null,{"$f":"J2611+O2611","v":0}]
[null,null,null,null,null,null,null,null,null,null,null,null,null,null,null,{"$f":"J2612+O2612","v":0}]
[null,null,null,null,null,null,null,null,null,null,null,null,null,null,null,{"$f":"J2613+O2613","v":0}]
[null,null,null,null,null,null,null,null,null,null,null,null,null,null,null,{"$f":"J2614+O2614","v":0}]
[null,null,null,null,null,null,null,null,null,null,null,null,null,null,null,{"$f":"J2615+O2615","v":0}]
[null,null,null,null,null,null,null,null,null,null,null,null,null,null,null,{"$f":"J2616+O2616","v":0}]
[null,null,null,null,null,null,null,null,null,null,null,null,null,null,null,{"$f":"J2617+O2617","v":0}]
[null,null,null,null,null,null,null,null,null,null,null,null,null,null,null,{"$f":"J2618+O2618","v":0}]
[null,null,null,null,null,null,null,null,null,null,null,null,null,null,null,{"$f":"J2619+O2619","v":0}]
[null,null,null,null,null,null,null,null,null,null,null,null,null,null,null,{"$f":"J2620+O2620","v":0}]
[null,null,null,null,null,null,null,null,null,null,null,null,null,null,null,{"$f":"J2621+O2621","v":0}]
[null,null,null,null,null,null,null,null,null,null,null,null,null,null,null,{"$f":"J2622+O2622","v":0}]
[null,null,null,null,null,null,null,null,null,null,null,null,null,null,null,{"$f":"J2623+O2623","v":0}]
[null,null,null,null,null,null,null,null,null,null,null,null,null,null,null,{"$f":"J2624+O2624","v":0}]
[null,null,null,null,null,null,null,null,null,null,null,null,null,null,null,{"$f":"J2625+O2625","v":0}]
[null,null,null,null,null,null,null,null,null,null,null,null,null,null,null,{"$f":"J2626+O2626","v":0}]
[null,null,null,null,null,null,null,null,null,null,null,null,null,null,null,{"$f":"J2627+O2627","v":0}]
[null,null,null,null,null,null,null,null,null,null,null,null,null,null,null,{"$f":"J2628+O2628","v":0}]
[null,null,null,null,null,null,null,null,null,null,null,null,null,null,null,{"$f":"J2629+O2629","v":0}]
[null,null,null,null,null,null,null,null,null,null,null,null,null,null,null,{"$f":"J2630+O2630","v":0}]
[null,null,null,null,null,null,null,null,null,null,null,null,null,null,null,{"$f":"J2631+O2631","v":0}]
[null,null,null,null,null,null,null,null,null,null,null,null,null,null,null,{"$f":"J2632+O2632","v":0}]
[null,null,null,null,null,null,null,null,null,null,null,null,null,null,null,{"$f":"J2633+O2633","v":0}]
[null,null,null,null,null,null,null,null,null,null,null,null,null,null,null,{"$f":"J2634+O2634","v":0}]
[null,null,null,null,null,null,null,null,null,null,null,null,null,null,null,{"$f":"J2635+O2635","v":0}]
[null,null,null,null,null,null,null,null,null,null,null,null,null,null,null,{"$f":"J2636+O2636","v":0}]
[null,null,null,null,null,null,null,null,null,null,null,null,null,null,null,{"$f":"J2637+O2637","v":0}]
[null,null,null,null,null,null,null,null,null,null,null,null,null,null,null,{"$f":"J2638+O2638","v":0}]
[null,null,null,null,null,null,null,null,null,null,null,null,null,null,null,{"$f":"J2639+O2639","v":0}]
[null,null,null,null,null,null,null,null,null,null,null,null,null,null,null,{"$f":"J2640+O2640","v":0}]
[null,null,null,null,null,null,null,null,null,null,null,null,null,null,null,{"$f":"J2641+O2641","v":0}]
[null,null,null,null,null,null,null,null,null,null,null,null,null,null,null,{"$f":"J2642+O2642","v":0}]
[null,null,null,null,null,null,null,null,null,null,null,null,null,null,null,{"$f":"J2643+O2643","v":0}]
[null,null,null,null,null,null,null,null,null,null,null,null,null,null,null,{"$f":"J2644+O2644","v":0}]
[null,null,null,null,null,null,null,null,null,null,null,null,null,null,null,{"$f":"J2645+O2645","v":0}]
[null,null,null,null,null,null,null,null,null,null,null,null,null,null,null,{"$f":"J2646+O2646","v":0}]
[null,null,null,null,null,null,null,null,null,null,null,null,null,null,null,{"$f":"J2647+O2647","v":0}]
[null,null,null,null,null,null,null,null,null,null,null,null,null,null,null,{"$f":"J2648+O2648","v":0}]
[null,null,null,null,null,null,null,null,null,null,null,null,null,null,null,{"$f":"J2649+O2649","v":0}]
[null,null,null,null,null,null,null,null,null,null,null,null,null,null,null,{"$f":"J2650+O2650","v":0}]
[null,null,null,null,null,null,null,null,null,null,null,null,null,null,null,{"$f":"J2651+O2651","v":0}]
[null,null,null,null,null,null,null,null,null,null,null,null,null,null,null,{"$f":"J2652+O2652","v":0}]
[null,null,null,null,null,null,null,null,null,null,null,null,null,null,null,{"$f":"J2653+O2653","v":0}]
[null,null,null,null,null,null,null,null,null,null,null,null,null,null,null,{"$f":"J2654+O2654","v":0}]
[null,null,null,null,null,null,null,null,null,null,null,null,null,null,null,{"$f":"J2655+O2655","v":0}]
[null,null,null,null,null,null,null,null,null,null,null,null,null,null,null,{"$f":"J2656+O2656","v":0}]
[null,null,null,null,null,null,null,null,null,null,null,null,null,null,null,{"$f":"J2657+O2657","v":0}]
[null,null,null,null,null,null,null,null,null,null,null,null,null,null,null,{"$f":"J2658+O2658","v":0}]
[null,null,null,null,null,null,null,null,null,null,null,null,null,null,null,{"$f":"J2659+O2659","v":0}]
[null,null,null,null,null,null,null,null,null,null,null,null,null,null,null,{"$f":"J2660+O2660","v":0}]
[null,null,null,null,null,null,null,null,null,null,null,null,null,null,null,{"$f":"J2661+O2661","v":0}]
[null,null,null,null,null,null,null,null,null,null,null,null,null,null,null,{"$f":"J2662+O2662","v":0}]
[null,null,null,null,null,null,null,null,null,null,null,null,null,null,null,{"$f":"J2663+O2663","v":0}]
[null,null,null,null,null,null,null,null,null,null,null,null,null,null,null,{"$f":"J2664+O2664","v":0}]
[null,null,null,null,null,null,null,null,null,null,null,null,null,null,null,{"$f":"J2665+O2665","v":0}]
[null,null,null,null,null,null,null,null,null,null,null,null,null,null,null,{"$f":"J2666+O2666","v":0}]
[null,null,null,null,null,null,null,null,null,null,null,null,null,null,null,{"$f":"J2667+O2667","v":0}]
[null,null,null,null,null,null,null,null,null,null,null,null,null,null,null,{"$f":"J2668+O2668","v":0}]
[null,null,null,null,null,null,null,null,null,null,null,null,null,null,null,{"$f":"J2669+O2669","v":0}]
[null,null,null,null,null,null,null,null,null,null,null,null,null,null,null,{"$f":"J2670+O2670","v":0}]
[null,null,null,null,null,null,null,null,null,null,null,null,null,null,null,{"$f":"J2671+O2671","v":0}]
[null,null,null,null,null,null,null,null,null,null,null,null,null,null,null,{"$f":"J2672+O2672","v":0}]
[null,null,null,null,null,null,null,null,null,null,null,null,null,null,null,{"$f":"J2673+O2673","v":0}]
[null,null,null,null,null,null,null,null,null,null,null,null,null,null,null,{"$f":"J2674+O2674","v":0}]
[null,null,null,null,null,null,null,null,null,null,null,null,null,null,null,{"$f":"J2675+O2675","v":0}]
[null,null,null,null,null,null,null,null,null,null,null,null,null,null,null,{"$f":"J2676+O2676","v":0}]
[null,null,null,null,null,null,null,null,null,null,null,null,null,null,null,{"$f":"J2677+O2677","v":0}]
[null,null,null,null,null,null,null,null,null,null,null,null,null,null,null,{"$f":"J2678+O2678","v":0}]
[null,null,null,null,null,null,null,null,null,null,null,null,null,null,null,{"$f":"J2679+O2679","v":0}]
[null,null,null,null,null,null,null,null,null,null,null,null,null,null,null,{"$f":"J2680+O2680","v":0}]
[null,null,null,null,null,null,null,null,null,null,null,null,null,null,null,{"$f":"J2681+O2681","v":0}]
[null,null,null,null,null,null,null,null,null,null,null,null,null,null,null,{"$f":"J2682+O2682","v":0}]
[null,null,null,null,null,null,null,null,null,null,null,null,null,null,null,{"$f":"J2683+O2683","v":0}]
[null,null,null,null,null,null,null,null,null,null,null,null,null,null,null,{"$f":"J2684+O2684","v":0}]
[null,null,null,null,null,null,null,null,null,null,null,null,null,null,null,{"$f":"J2685+O2685","v":0}]
[null,null,null,null,null,null,null,null,null,null,null,null,null,null,null,{"$f":"J2686+O2686","v":0}]
[null,null,null,null,null,null,null,null,null,null,null,null,null,null,null,{"$f":"J2687+O2687","v":0}]
[null,null,null,null,null,null,null,null,null,null,null,null,null,null,null,{"$f":"J2688+O2688","v":0}]
[null,null,null,null,null,null,null,null,null,null,null,null,null,null,null,{"$f":"J2689+O2689","v":0}]
[null,null,null,null,null,null,null,null,null,null,null,null,null,null,null,{"$f":"J2690+O2690","v":0}]
[null,null,null,null,null,null,null,null,null,null,null,null,null,null,null,{"$f":"J2691+O2691","v":0}]
[null,null,null,null,null,null,null,null,null,null,null,null,null,null,null,{"$f":"J2692+O2692","v":0}]
[null,null,null,null,null,null,null,null,null,null,null,null,null,null,null,{"$f":"J2693+O2693","v":0}]
[null,null,null,null,null,null,null,null,null,null,null,null,null,null,null,{"$f":"J2694+O2694","v":0}]
[null,null,null,null,null,null,null,null,null,null,null,null,null,null,null,{"$f":"J2695+O2695","v":0}]
[null,null,null,null,null,null,null,null,null,null,null,null,null,null,null,{"$f":"J2696+O2696","v":0}]
[null,null,null,null,null,null,null,null,null,null,null,null,null,null,null,{"$f":"J2697+O2697","v":0}]
[null,null,null,null,null,null,null,null,null,null,null,null,null,null,null,{"$f":"J2698+O2698","v":0}]
[null,null,null,null,null,null,null,null,null,null,null,null,null,null,null,{"$f":"J2699+O2699","v":0}]
[null,null,null,null,null,null,null,null,null,null,null,null,null,null,null,{"$f":"J2700+O2700","v":0}]
[null,null,null,null,null,null,null,null,null,null,null,null,null,null,null,{"$f":"J2701+O2701","v":0}]
[null,null,null,null,null,null,null,null,null,null,null,null,null,null,null,{"$f":"J2702+O2702","v":0}]
[null,null,null,null,null,null,null,null,null,null,null,null,null,null,null,{"$f":"J2703+O2703","v":0}]
[null,null,null,null,null,null,null,null,null,null,null,null,null,null,null,{"$f":"J2704+O2704","v":0}]
[null,null,null,null,null,null,null,null,null,null,null,null,null,null,null,{"$f":"J2705+O2705","v":0}]
[null,null,null,null,null,null,null,null,null,null,null,null,null,null,null,{"$f":"J2706+O2706","v":0}]
[null,null,null,null,null,null,null,null,null,null,null,null,null,null,null,{"$f":"J2707+O2707","v":0}]
[null,null,null,null,null,null,null,null,null,null,null,null,null,null,null,{"$f":"J2708+O2708","v":0}]
[null,null,null,null,null,null,null,null,null,null,null,null,null,null,null,{"$f":"J2709+O2709","v":0}]
[null,null,null,null,null,null,null,null,null,null,null,null,null,null,null,{"$f":"J2710+O2710","v":0}]
[null,null,null,null,null,null,null,null,null,null,null,null,null,null,null,{"$f":"J2711+O2711","v":0}]
[null,null,null,null,null,null,null,null,null,null,null,null,null,null,null,{"$f":"J2712+O2712","v":0}]
[null,null,null,null,null,null,null,null,null,null,null,null,null,null,null,{"$f":"J2713+O2713","v":0}]
[null,null,null,null,null,null,null,null,null,null,null,null,null,null,null,{"$f":"J2714+O2714","v":0}]
[null,null,null,null,null,null,null,null,null,null,null,null,null,null,null,{"$f":"J2715+O2715","v":0}]
[null,null,null,null,null,null,null,null,null,null,null,null,null,null,null,{"$f":"J2716+O2716","v":0}]
[null,null,null,null,null,null,null,null,null,null,null,null,null,null,null,{"$f":"J2717+O2717","v":0}]
[null,null,null,null,null,null,null,null,null,null,null,null,null,null,null,{"$f":"J2718+O2718","v":0}]
[null,null,null,null,null,null,null,null,null,null,null,null,null,null,null,{"$f":"J2719+O2719","v":0}]
[null,null,null,null,null,null,null,null,null,null,null,null,null,null,null,{"$f":"J2720+O2720","v":0}]
[null,null,null,null,null,null,null,null,null,null,null,null,null,null,null,{"$f":"J2721+O2721","v":0}]
[null,null,null,null,null,null,null,null,null,null,null,null,null,null,null,{"$f":"J2722+O2722","v":0}]
[null,null,null,null,null,null,null,null,null,null,null,null,null,null,null,{"$f":"J2723+O2723","v":0}]
[null,null,null,null,null,null,null,null,null,null,null,null,null,null,null,{"$f":"J2724+O2724","v":0}]
[null,null,null,null,null,null,null,null,null,null,null,null,null,null,null,{"$f":"J2725+O2725","v":0}]
[null,null,null,null,null,null,null,null,null,null,null,null,null,null,null,{"$f":"J2726+O2726","v":0}]
[null,null,null,null,null,null,null,null,null,null,null,null,null,null,null,{"$f":"J2727+O2727","v":0}]
[null,null,null,null,null,null,null,null,null,null,null,null,null,null,null,{"$f":"J2728+O2728","v":0}]
[null,null,null,null,null,null,null,null,null,null,null,null,null,null,null,{"$f":"J2729+O2729","v":0}]
[null,null,null,null,null,null,null,null,null,null,null,null,null,null,null,{"$f":"J2730+O2730","v":0}]
[null,null,null,null,null,null,null,null,null,null,null,null,null,null,null,{"$f":"J2731+O2731","v":0}]
[null,null,null,null,null,null,null,null,null,null,null,null,null,null,null,{"$f":"J2732+O2732","v":0}]
[null,null,null,null,null,null,null,null,null,null,null,null,null,null,null,{"$f":"J2733+O2733","v":0}]
[null,null,null,null,null,null,null,null,null,null,null,null,null,null,null,{"$f":"J2734+O2734","v":0}]
[null,null,null,null,null,null,null,null,null,null,null,null,null,null,null,{"$f":"J2735+O2735","v":0}]
[null,null,null,null,null,null,null,null,null,null,null,null,null,null,null,{"$f":"J2736+O2736","v":0}]
[null,null,null,null,null,null,null,null,null,null,null,null,null,null,null,{"$f":"J2737+O2737","v":0}]
[null,null,null,null,null,null,null,null,null,null,null,null,null,null,null,{"$f":"J2738+O2738","v":0}]
[null,null,null,null,null,null,null,null,null,null,null,null,null,null,null,{"$f":"J2739+O2739","v":0}]
[null,null,null,null,null,null,null,null,null,null,null,null,null,null,null,{"$f":"J2740+O2740","v":0}]
[null,null,null,null,null,null,null,null,null,null,null,null,null,null,null,{"$f":"J2741+O2741","v":0}]
[null,null,null,null,null,null,null,null,null,null,null,null,null,null,null,{"$f":"J2742+O2742","v":0}]
[null,null,null,null,null,null,null,null,null,null,null,null,null,null,null,{"$f":"J2743+O2743","v":0}]
[null,null,null,null,null,null,null,null,null,null,null,null,null,null,null,{"$f":"J2744+O2744","v":0}]
[null,null,null,null,null,null,null,null,null,null,null,null,null,null,null,{"$f":"J2745+O2745","v":0}]
[null,null,null,null,null,null,null,null,null,null,null,null,null,null,null,{"$f":"J2746+O2746","v":0}]
[null,null,null,null,null,null,null,null,null,null,null,null,null,null,null,{"$f":"J2747+O2747","v":0}]
[null,null,null,null,null,null,null,null,null,null,null,null,null,null,null,{"$f":"J2748+O2748","v":0}]
[null,null,null,null,null,null,null,null,null,null,null,null,null,null,null,{"$f":"J2749+O2749","v":0}]
[null,null,null,null,null,null,null,null,null,null,null,null,null,null,null,{"$f":"J2750+O2750","v":0}]
[null,null,null,null,null,null,null,null,null,null,null,null,null,null,null,{"$f":"J2751+O2751","v":0}]
[null,null,null,null,null,null,null,null,null,null,null,null,null,null,null,{"$f":"J2752+O2752","v":0}]
[null,null,null,null,null,null,null,null,null,null,null,null,null,null,null,{"$f":"J2753+O2753","v":0}]
[null,null,null,null,null,null,null,null,null,null,null,null,null,null,null,{"$f":"J2754+O2754","v":0}]
[null,null,null,null,null,null,null,null,null,null,null,null,null,null,null,{"$f":"J2755+O2755","v":0}]
[null,null,null,null,null,null,null,null,null,null,null,null,null,null,null,{"$f":"J2756+O2756","v":0}]
[null,null,null,null,null,null,null,null,null,null,null,null,null,null,null,{"$f":"J2757+O2757","v":0}]
[null,null,null,null,null,null,null,null,null,null,null,null,null,null,null,{"$f":"J2758+O2758","v":0}]
[null,null,null,null,null,null,null,null,null,null,null,null,null,null,null,{"$f":"J2759+O2759","v":0}]
[null,null,null,null,null,null,null,null,null,null,null,null,null,null,null,{"$f":"J2760+O2760","v":0}]
[null,null,null,null,null,null,null,null,null,null,null,null,null,null,null,{"$f":"J2761+O2761","v":0}]
[null,null,null,null,null,null,null,null,null,null,null,null,null,null,null,{"$f":"J2762+O2762","v":0}]
[null,null,null,null,null,null,null,null,null,null,null,null,null,null,null,{"$f":"J2763+O2763","v":0}]
[null,null,null,null,null,null,null,null,null,null,null,null,null,null,null,{"$f":"J2764+O2764","v":0}]
[null,null,null,null,null,null,null,null,null,null,null,null,null,null,null,{"$f":"J2765+O2765","v":0}]
[null,null,null,null,null,null,null,null,null,null,null,null,null,null,null,{"$f":"J2766+O2766","v":0}]
[null,null,null,null,null,null,null,null,null,null,null,null,null,null,null,{"$f":"J2767+O2767","v":0}]
[null,null,null,null,null,null,null,null,null,null,null,null,null,null,null,{"$f":"J2768+O2768","v":0}]
[null,null,null,null,null,null,null,null,null,null,null,null,null,null,null,{"$f":"J2769+O2769","v":0}]
[null,null,null,null,null,null,null,null,null,null,null,null,null,null,null,{"$f":"J2770+O2770","v":0}]
[null,null,null,null,null,null,null,null,null,null,null,null,null,null,null,{"$f":"J2771+O2771","v":0}]
[null,null,null,null,null,null,null,null,null,null,null,null,null,null,null,{"$f":"J2772+O2772","v":0}]
[null,null,null,null,null,null,null,null,null,null,null,null,null,null,null,{"$f":"J2773+O2773","v":0}]
[null,null,null,null,null,null,null,null,null,null,null,null,null,null,null,{"$f":"J2774+O2774","v":0}]
[null,null,null,null,null,null,null,null,null,null,null,null,null,null,null,{"$f":"J2775+O2775","v":0}]
[null,null,null,null,null,null,null,null,null,null,null,null,null,null,null,{"$f":"J2776+O2776","v":0}]
[null,null,null,null,null,null,null,null,null,null,null,null,null,null,null,{"$f":"J2777+O2777","v":0}]
[null,null,null,null,null,null,null,null,null,null,null,null,null,null,null,{"$f":"J2778+O2778","v":0}]
[null,null,null,null,null,null,null,null,null,null,null,null,null,null,null,{"$f":"J2779+O2779","v":0}]
[null,null,null,null,null,null,null,null,null,null,null,null,null,null,null,{"$f":"J2780+O2780","v":0}]
[null,null,null,null,null,null,null,null,null,null,null,null,null,null,null,{"$f":"J2781+O2781","v":0}]
[null,null,null,null,null,null,null,null,null,null,null,null,null,null,null,{"$f":"J2782+O2782","v":0}]
[null,null,null,null,null,null,null,null,null,null,null,null,null,null,null,{"$f":"J2783+O2783","v":0}]
[null,null,null,null,null,null,null,null,null,null,null,null,null,null,null,{"$f":"J2784+O2784","v":0}]
[null,null,null,null,null,null,null,null,null,null,null,null,null,null,null,{"$f":"J2785+O2785","v":0}]
[null,null,null,null,null,null,null,null,null,null,null,null,null,null,null,{"$f":"J2786+O2786","v":0}]
[null,null,null,null,null,null,null,null,null,null,null,null,null,null,null,{"$f":"J2787+O2787","v":0}]
[null,null,null,null,null,null,null,null,null,null,null,null,null,null,null,{"$f":"J2788+O2788","v":0}]
[null,null,null,null,null,null,null,null,null,null,null,null,null,null,null,{"$f":"J2789+O2789","v":0}]
[null,null,null,null,null,null,null,null,null,null,null,null,null,null,null,{"$f":"J2790+O2790","v":0}]
[null,null,null,null,null,null,null,null,null,null,null,null,null,null,null,{"$f":"J2791+O2791","v":0}]
[null,null,null,null,null,null,null,null,null,null,null,null,null,null,null,{"$f":"J2792+O2792","v":0}]
[null,null,null,null,null,null,null,null,null,null,null,null,null,null,null,{"$f":"J2793+O2793","v":0}]
[null,null,null,null,null,null,null,null,null,null,null,null,null,null,null,{"$f":"J2794+O2794","v":0}]
[null,null,null,null,null,null,null,null,null,null,null,null,null,null,null,{"$f":"J2795+O2795","v":0}]
[null,null,null,null,null,null,null,null,null,null,null,null,null,null,null,{"$f":"J2796+O2796","v":0}]
[null,null,null,null,null,null,null,null,null,null,null,null,null,null,null,{"$f":"J2797+O2797","v":0}]
[null,null,null,null,null,null,null,null,null,null,null,null,null,null,null,{"$f":"J2798+O2798","v":0}]
[null,null,null,null,null,null,null,null,null,null,null,null,null,null,null,{"$f":"J2799+O2799","v":0}]
[null,null,null,null,null,null,null,null,null,null,null,null,null,null,null,{"$f":"J2800+O2800","v":0}]
[null,null,null,null,null,null,null,null,null,null,null,null,null,null,null,{"$f":"J2801+O2801","v":0}]
[null,null,null,null,null,null,null,null,null,null,null,null,null,null,null,{"$f":"J2802+O2802","v":0}]
[null,null,null,null,null,null,null,null,null,null,null,null,null,null,null,{"$f":"J2803+O2803","v":0}]
[null,null,null,null,null,null,null,null,null,null,null,null,null,null,null,{"$f":"J2804+O2804","v":0}]
[null,null,null,null,null,null,null,null,null,null,null,null,null,null,null,{"$f":"J2805+O2805","v":0}]
[null,null,null,null,null,null,null,null,null,null,null,null,null,null,null,{"$f":"J2806+O2806","v":0}]
[null,null,null,null,null,null,null,null,null,null,null,null,null,null,null,{"$f":"J2807+O2807","v":0}]
[null,null,null,null,null,null,null,null,null,null,null,null,null,null,null,{"$f":"J2808+O2808","v":0}]
[null,null,null,null,null,null,null,null,null,null,null,null,null,null,null,{"$f":"J2809+O2809","v":0}]
[null,null,null,null,null,null,null,null,null,null,null,null,null,null,null,{"$f":"J2810+O2810","v":0}]
[null,null,null,null,null,null,null,null,null,null,null,null,null,null,null,{"$f":"J2811+O2811","v":0}]
[null,null,null,null,null,null,null,null,null,null,null,null,null,null,null,{"$f":"J2812+O2812","v":0}]
[null,null,null,null,null,null,null,null,null,null,null,null,null,null,null,{"$f":"J2813+O2813","v":0}]
[null,null,null,null,null,null,null,null,null,null,null,null,null,null,null,{"$f":"J2814+O2814","v":0}]
[null,null,null,null,null,null,null,null,null,null,null,null,null,null,null,{"$f":"J2815+O2815","v":0}]
[null,null,null,null,null,null,null,null,null,null,null,null,null,null,null,{"$f":"J2816+O2816","v":0}]
[null,null,null,null,null,null,null,null,null,null,null,null,null,null,null,{"$f":"J2817+O2817","v":0}]
[null,null,null,null,null,null,null,null,null,null,null,null,null,null,null,{"$f":"J2818+O2818","v":0}]
[null,null,null,null,null,null,null,null,null,null,null,null,null,null,null,{"$f":"J2819+O2819","v":0}]
[null,null,null,null,null,null,null,null,null,null,null,null,null,null,null,{"$f":"J2820+O2820","v":0}]
[null,null,null,null,null,null,null,null,null,null,null,null,null,null,null,{"$f":"J2821+O2821","v":0}]
[null,null,null,null,null,null,null,null,null,null,null,null,null,null,null,{"$f":"J2822+O2822","v":0}]
[null,null,null,null,null,null,null,null,null,null,null,null,null,null,null,{"$f":"J2823+O2823","v":0}]
[null,null,null,null,null,null,null,null,null,null,null,null,null,null,null,{"$f":"J2824+O2824","v":0}]
[null,null,null,null,null,null,null,null,null,null,null,null,null,null,null,{"$f":"J2825+O2825","v":0}]
[null,null,null,null,null,null,null,null,null,null,null,null,null,null,null,{"$f":"J2826+O2826","v":0}]
[null,null,null,null,null,null,null,null,null,null,null,null,null,null,null,{"$f":"J2827+O2827","v":0}]
[null,null,null,null,null,null,null,null,null,null,null,null,null,null,null,{"$f":"J2828+O2828","v":0}]
[null,null,null,null,null,null,null,null,null,null,null,null,null,null,null,{"$f":"J2829+O2829","v":0}]
[null,null,null,null,null,null,null,null,null,null,null,null,null,null,null,{"$f":"J2830+O2830","v":0}]
[null,null,null,null,null,null,null,null,null,null,null,null,null,null,null,{"$f":"J2831+O2831","v":0}]
[null,null,null,null,null,null,null,null,null,null,null,null,null,null,null,{"$f":"J2832+O2832","v":0}]
[null,null,null,null,null,null,null,null,null,null,null,null,null,null,null,{"$f":"J2833+O2833","v":0}]
[null,null,null,null,null,null,null,null,null,null,null,null,null,null,null,{"$f":"J2834+O2834","v":0}]
[null,null,null,null,null,null,null,null,null,null,null,null,null,null,null,{"$f":"J2835+O2835","v":0}]
[null,null,null,null,null,null,null,null,null,null,null,null,null,null,null,{"$f":"J2836+O2836","v":0}]
[null,null,null,null,null,null,null,null,null,null,null,null,null,null,null,{"$f":"J2837+O2837","v":0}]
[null,null,null,null,null,null,null,null,null,null,null,null,null,null,null,{"$f":"J2838+O2838","v":0}]
[null,null,null,null,null,null,null,null,null,null,null,null,null,null,null,{"$f":"J2839+O2839","v":0}]
[null,null,null,null,null,null,null,null,null,null,null,null,null,null,null,{"$f":"J2840+O2840","v":0}]
[null,null,null,null,null,null,null,null,null,null,null,null,null,null,null,{"$f":"J2841+O2841","v":0}]
[null,null,null,null,null,null,null,null,null,null,null,null,null,null,null,{"$f":"J2842+O2842","v":0}]
[null,null,null,null,null,null,null,null,null,null,null,null,null,null,null,{"$f":"J2843+O2843","v":0}]
[null,null,null,null,null,null,null,null,null,null,null,null,null,null,null,{"$f":"J2844+O2844","v":0}]
[null,null,null,null,null,null,null,null,null,null,null,null,null,null,null,{"$f":"J2845+O2845","v":0}]
[null,null,null,null,null,null,null,null,null,null,null,null,null,null,null,{"$f":"J2846+O2846","v":0}]
[null,null,null,null,null,null,null,null,null,null,null,null,null,null,null,{"$f":"J2847+O2847","v":0}]
[null,null,null,null,null,null,null,null,null,null,null,null,null,null,null,{"$f":"J2848+O2848","v":0}]
[null,null,null,null,null,null,null,null,null,null,null,null,null,null,null,{"$f":"J2849+O2849","v":0}]
[null,null,null,null,null,null,null,null,null,null,null,null,null,null,null,{"$f":"J2850+O2850","v":0}]
[null,null,null,null,null,null,null,null,null,null,null,null,null,null,null,{"$f":"J2851+O2851","v":0}]
[null,null,null,null,null,null,null,null,null,null,null,null,null,null,null,{"$f":"J2852+O2852","v":0}]
[null,null,null,null,null,null,null,null,null,null,null,null,null,null,null,{"$f":"J2853+O2853","v":0}]
[null,null,null,null,null,null,null,null,null,null,null,null,null,null,null,{"$f":"J2854+O2854","v":0}]
[null,null,null,null,null,null,null,null,null,null,null,null,null,null,null,{"$f":"J2855+O2855","v":0}]
[null,null,null,null,null,null,null,null,null,null,null,null,null,null,null,{"$f":"J2856+O2856","v":0}]
[null,null,null,null,null,null,null,null,null,null,null,null,null,null,null,{"$f":"J2857+O2857","v":0}]
[null,null,null,null,null,null,null,null,null,null,null,null,null,null,null,{"$f":"J2858+O2858","v":0}]
[null,null,null,null,null,null,null,null,null,null,null,null,null,null,null,{"$f":"J2859+O2859","v":0}]
[null,null,null,null,null,null,null,null,null,null,null,null,null,null,null,{"$f":"J2860+O2860","v":0}]
[null,null,null,null,null,null,null,null,null,null,null,null,null,null,null,{"$f":"J2861+O2861","v":0}]
[null,null,null,null,null,null,null,null,null,null,null,null,null,null,null,{"$f":"J2862+O2862","v":0}]
[null,null,null,null,null,null,null,null,null,null,null,null,null,null,null,{"$f":"J2863+O2863","v":0}]
[null,null,null,null,null,null,null,null,null,null,null,null,null,null,null,{"$f":"J2864+O2864","v":0}]
[null,null,null,null,null,null,null,null,null,null,null,null,null,null,null,{"$f":"J2865+O2865","v":0}]
[null,null,null,null,null,null,null,null,null,null,null,null,null,null,null,{"$f":"J2866+O2866","v":0}]
[null,null,null,null,null,null,null,null,null,null,null,null,null,null,null,{"$f":"J2867+O2867","v":0}]
[null,null,null,null,null,null,null,null,null,null,null,null,null,null,null,{"$f":"J2868+O2868","v":0}]
[null,null,null,null,null,null,null,null,null,null,null,null,null,null,null,{"$f":"J2869+O2869","v":0}]
[null,null,null,null,null,null,null,null,null,null,null,null,null,null,null,{"$f":"J2870+O2870","v":0}]
[null,null,null,null,null,null,null,null,null,null,null,null,null,null,null,{"$f":"J2871+O2871","v":0}]
[null,null,null,null,null,null,null,null,null,null,null,null,null,null,null,{"$f":"J2872+O2872","v":0}]
[null,null,null,null,null,null,null,null,null,null,null,null,null,null,null,{"$f":"J2873+O2873","v":0}]
[null,null,null,null,null,null,null,null,null,null,null,null,null,null,null,{"$f":"J2874+O2874","v":0}]
[null,null,null,null,null,null,null,null,null,null,null,null,null,null,null,{"$f":"J2875+O2875","v":0}]
[null,null,null,null,null,null,null,null,null,null,null,null,null,null,null,{"$f":"J2876+O2876","v":0}]
[null,null,null,null,null,null,null,null,null,null,null,null,null,null,null,{"$f":"J2877+O2877","v":0}]
[null,null,null,null,null,null,null,null,null,null,null,null,null,null,null,{"$f":"J2878+O2878","v":0}]
[null,null,null,null,null,null,null,null,null,null,null,null,null,null,null,{"$f":"J2879+O2879","v":0}]
[null,null,null,null,null,null,null,null,null,null,null,null,null,null,null,{"$f":"J2880+O2880","v":0}]
[null,null,null,null,null,null,null,null,null,null,null,null,null,null,null,{"$f":"J2881+O2881","v":0}]
[null,null,null,null,null,null,null,null,null,null,null,null,null,null,null,{"$f":"J2882+O2882","v":0}]
[null,null,null,null,null,null,null,null,null,null,null,null,null,null,null,{"$f":"J2883+O2883","v":0}]
[null,null,null,null,null,null,null,null,null,null,null,null,null,null,null,{"$f":"J2884+O2884","v":0}]
[null,null,null,null,null,null,null,null,null,null,null,null,null,null,null,{"$f":"J2885+O2885","v":0}]
[null,null,null,null,null,null,null,null,null,null,null,null,null,null,null,{"$f":"J2886+O2886","v":0}]
[null,null,null,null,null,null,null,null,null,null,null,null,null,null,null,{"$f":"J2887+O2887","v":0}]
[null,null,null,null,null,null,null,null,null,null,null,null,null,null,null,{"$f":"J2888+O2888","v":0}]
[null,null,null,null,null,null,null,null,null,null,null,null,null,null,null,{"$f":"J2889+O2889","v":0}]
[null,null,null,null,null,null,null,null,null,null,null,null,null,null,null,{"$f":"J2890+O2890","v":0}]
[null,null,null,null,null,null,null,null,null,null,null,null,null,null,null,{"$f":"J2891+O2891","v":0}]
[null,null,null,null,null,null,null,null,null,null,null,null,null,null,null,{"$f":"J2892+O2892","v":0}]
[null,null,null,null,null,null,null,null,null,null,null,null,null,null,null,{"$f":"J2893+O2893","v":0}]
[null,null,null,null,null,null,null,null,null,null,null,null,null,null,null,{"$f":"J2894+O2894","v":0}]
[null,null,null,null,null,null,null,null,null,null,null,null,null,null,null,{"$f":"J2895+O2895","v":0}]
[null,null,null,null,null,null,null,null,null,null,null,null,null,null,null,{"$f":"J2896+O2896","v":0}]
[null,null,null,null,null,null,null,null,null,null,null,null,null,null,null,{"$f":"J2897+O2897","v":0}]
[null,null,null,null,null,null,null,null,null,null,null,null,null,null,null,{"$f":"J2898+O2898","v":0}]
[null,null,null,null,null,null,null,null,null,null,null,null,null,null,null,{"$f":"J2899+O2899","v":0}]
[null,null,null,null,null,null,null,null,null,null,null,null,null,null,null,{"$f":"J2900+O2900","v":0}]
[null,null,null,null,null,null,null,null,null,null,null,null,null,null,null,{"$f":"J2901+O2901","v":0}]
[null,null,null,null,null,null,null,null,null,null,null,null,null,null,null,{"$f":"J2902+O2902","v":0}]
[null,null,null,null,null,null,null,null,null,null,null,null,null,null,null,{"$f":"J2903+O2903","v":0}]
[null,null,null,null,null,null,null,null,null,null,null,null,null,null,null,{"$f":"J2904+O2904","v":0}]
[null,null,null,null,null,null,null,null,null,null,null,null,null,null,null,{"$f":"J2905+O2905","v":0}]
[null,null,null,null,null,null,null,null,null,null,null,null,null,null,null,{"$f":"J2906+O2906","v":0}]
[null,null,null,null,null,null,null,null,null,null,null,null,null,null,null,{"$f":"J2907+O2907","v":0}]
[null,null,null,null,null,null,null,null,null,null,null,null,null,null,null,{"$f":"J2908+O2908","v":0}]
[null,null,null,null,null,null,null,null,null,null,null,null,null,null,null,{"$f":"J2909+O2909","v":0}]
[null,null,null,null,null,null,null,null,null,null,null,null,null,null,null,{"$f":"J2910+O2910","v":0}]
[null,null,null,null,null,null,null,null,null,null,null,null,null,null,null,{"$f":"J2911+O2911","v":0}]
[null,null,null,null,null,null,null,null,null,null,null,null,null,null,null,{"$f":"J2912+O2912","v":0}]
[null,null,null,null,null,null,null,null,null,null,null,null,null,null,null,{"$f":"J2913+O2913","v":0}]
[null,null,null,null,null,null,null,null,null,null,null,null,null,null,null,{"$f":"J2914+O2914","v":0}]
[null,null,null,null,null,null,null,null,null,null,null,null,null,null,null,{"$f":"J2915+O2915","v":0}]
[null,null,null,null,null,null,null,null,null,null,null,null,null,null,null,{"$f":"J2916+O2916","v":0}]
[null,null,null,null,null,null,null,null,null,null,null,null,null,null,null,{"$f":"J2917+O2917","v":0}]
[null,null,null,null,null,null,null,null,null,null,null,null,null,null,null,{"$f":"J2918+O2918","v":0}]
[null,null,null,null,null,null,null,null,null,null,null,null,null,null,null,{"$f":"J2919+O2919","v":0}]
[null,null,null,null,null,null,null,null,null,null,null,null,null,null,null,{"$f":"J2920+O2920","v":0}]
[null,null,null,null,null,null,null,null,null,null,null,null,null,null,null,{"$f":"J2921+O2921","v":0}]
[null,null,null,null,null,null,null,null,null,null,null,null,null,null,null,{"$f":"J2922+O2922","v":0}]
[null,null,null,null,null,null,null,null,null,null,null,null,null,null,null,{"$f":"J2923+O2923","v":0}]
[null,null,null,null,null,null,null,null,null,null,null,null,null,null,null,{"$f":"J2924+O2924","v":0}]
[null,null,null,null,null,null,null,null,null,null,null,null,null,null,null,{"$f":"J2925+O2925","v":0}]
[null,null,null,null,null,null,null,null,null,null,null,null,null,null,null,{"$f":"J2926+O2926","v":0}]
[null,null,null,null,null,null,null,null,null,null,null,null,null,null,null,{"$f":"J2927+O2927","v":0}]
[null,null,null,null,null,null,null,null,null,null,null,null,null,null,null,{"$f":"J2928+O2928","v":0}]
[null,null,null,null,null,null,null,null,null,null,null,null,null,null,null,{"$f":"J2929+O2929","v":0}]
[null,null,null,null,null,null,null,null,null,null,null,null,null,null,null,{"$f":"J2930+O2930","v":0}]
[null,null,null,null,null,null,null,null,null,null,null,null,null,null,null,{"$f":"J2931+O2931","v":0}]
[null,null,null,null,null,null,null,null,null,null,null,null,null,null,null,{"$f":"J2932+O2932","v":0}]
[null,null,null,null,null,null,null,null,null,null,null,null,null,null,null,{"$f":"J2933+O2933","v":0}]
[null,null,null,null,null,null,null,null,null,null,null,null,null,null,null,{"$f":"J2934+O2934","v":0}]
[null,null,null,null,null,null,null,null,null,null,null,null,null,null,null,{"$f":"J2935+O2935","v":0}]
[null,null,null,null,null,null,null,null,null,null,null,null,null,null,null,{"$f":"J2936+O2936","v":0}]
[null,null,null,null,null,null,null,null,null,null,null,null,null,null,null,{"$f":"J2937+O2937","v":0}]
[null,null,null,null,null,null,null,null,null,null,null,null,null,null,null,{"$f":"J2938+O2938","v":0}]
[null,null,null,null,null,null,null,null,null,null,null,null,null,null,null,{"$f":"J2939+O2939","v":0}]
[null,null,null,null,null,null,null,null,null,null,null,null,null,null,null,{"$f":"J2940+O2940","v":0}]
[null,null,null,null,null,null,null,null,null,null,null,null,null,null,null,{"$f":"J2941+O2941","v":0}]
[null,null,null,null,null,null,null,null,null,null,null,null,null,null,null,{"$f":"J2942+O2942","v":0}]
[null,null,null,null,null,null,null,null,null,null,null,null,null,null,null,{"$f":"J2943+O2943","v":0}]
[null,null,null,null,null,null,null,null,null,null,null,null,null,null,null,{"$f":"J2944+O2944","v":0}]
[null,null,null,null,null,null,null,null,null,null,null,null,null,null,null,{"$f":"J2945+O2945","v":0}]
[null,null,null,null,null,null,null,null,null,null,null,null,null,null,null,{"$f":"J2946+O2946","v":0}]
[null,null,null,null,null,null,null,null,null,null,null,null,null,null,null,{"$f":"J2947+O2947","v":0}]
[null,null,null,null,null,null,null,null,null,null,null,null,null,null,null,{"$f":"J2948+O2948","v":0}]
[null,null,null,null,null,null,null,null,null,null,null,null,null,null,null,{"$f":"J2949+O2949","v":0}]
[null,null,null,null,null,null,null,null,null,null,null,null,null,null,null,{"$f":"J2950+O2950","v":0}]
[null,null,null,null,null,null,null,null,null,null,null,null,null,null,null,{"$f":"J2951+O2951","v":0}]
[null,null,null,null,null,null,null,null,null,null,null,null,null,null,null,{"$f":"J2952+O2952","v":0}]
[null,null,null,null,null,null,null,null,null,null,null,null,null,null,null,{"$f":"J2953+O2953","v":0}]
[null,null,null,null,null,null,null,null,null,null,null,null,null,null,null,{"$f":"J2954+O2954","v":0}]
[null,null,null,null,null,null,null,null,null,null,null,null,null,null,null,{"$f":"J2955+O2955","v":0}]
[null,null,null,null,null,null,null,null,null,null,null,null,null,null,null,{"$f":"J2956+O2956","v":0}]
[null,null,null,null,null,null,null,null,null,null,null,null,null,null,null,{"$f":"J2957+O2957","v":0}]
[null,null,null,null,null,null,null,null,null,null,null,null,null,null,null,{"$f":"J2958+O2958","v":0}]
[null,null,null,null,null,null,null,null,null,null,null,null,null,null,null,{"$f":"J2959+O2959","v":0}]
[null,null,null,null,null,null,null,null,null,null,null,null,null,null,null,{"$f":"J2960+O2960","v":0}]
[null,null,null,null,null,null,null,null,null,null,null,null,null,null,null,{"$f":"J2961+O2961","v":0}]
[null,null,null,null,null,null,null,null,null,null,null,null,null,null,null,{"$f":"J2962+O2962","v":0}]
[null,null,null,null,null,null,null,null,null,null,null,null,null,null,null,{"$f":"J2963+O2963","v":0}]
[null,null,null,null,null,null,null,null,null,null,null,null,null,null,null,{"$f":"J2964+O2964","v":0}]
[null,null,null,null,null,null,null,null,null,null,null,null,null,null,null,{"$f":"J2965+O2965","v":0}]
[null,null,null,null,null,null,null,null,null,null,null,null,null,null,null,{"$f":"J2966+O2966","v":0}]
[null,null,null,null,null,null,null,null,null,null,null,null,null,null,null,{"$f":"J2967+O2967","v":0}]
[null,null,null,null,null,null,null,null,null,null,null,null,null,null,null,{"$f":"J2968+O2968","v":0}]
[null,null,null,null,null,null,null,null,null,null,null,null,null,null,null,{"$f":"J2969+O2969","v":0}]
[null,null,null,null,null,null,null,null,null,null,null,null,null,null,null,{"$f":"J2970+O2970","v":0}]
[null,null,null,null,null,null,null,null,null,null,null,null,null,null,null,{"$f":"J2971+O2971","v":0}]
[null,null,null,null,null,null,null,null,null,null,null,null,null,null,null,{"$f":"J2972+O2972","v":0}]
[null,null,null,null,null,null,null,null,null,null,null,null,null,null,null,{"$f":"J2973+O2973","v":0}]
[null,null,null,null,null,null,null,null,null,null,null,null,null,null,null,{"$f":"J2974+O2974","v":0}]
[null,null,null,null,null,null,null,null,null,null,null,null,null,null,null,{"$f":"J2975+O2975","v":0}]
[null,null,null,null,null,null,null,null,null,null,null,null,null,null,null,{"$f":"J2976+O2976","v":0}]
[null,null,null,null,null,null,null,null,null,null,null,null,null,null,null,{"$f":"J2977+O2977","v":0}]
[null,null,null,null,null,null,null,null,null,null,null,null,null,null,null,{"$f":"J2978+O2978","v":0}]
[null,null,null,null,null,null,null,null,null,null,null,null,null,null,null,{"$f":"J2979+O2979","v":0}]
[null,null,null,null,null,null,null,null,null,null,null,null,null,null,null,{"$f":"J2980+O2980","v":0}]
[null,null,null,null,null,null,null,null,null,null,null,null,null,null,null,{"$f":"J2981+O2981","v":0}]
[null,null,null,null,null,null,null,null,null,null,null,null,null,null,null,{"$f":"J2982+O2982","v":0}]
[null,null,null,null,null,null,null,null,null,null,null,null,null,null,null,{"$f":"J2983+O2983","v":0}]
[null,null,null,null,null,null,null,null,null,null,null,null,null,null,null,{"$f":"J2984+O2984","v":0}]
[null,null,null,null,null,null,null,null,null,null,null,null,null,null,null,{"$f":"J2985+O2985","v":0}]
[null,null,null,null,null,null,null,null,null,null,null,null,null,null,null,{"$f":"J2986+O2986","v":0}]
[null,null,null,null,null,null,null,null,null,null,null,null,null,null,null,{"$f":"J2987+O2987","v":0}]
[null,null,null,null,null,null,null,null,null,null,null,null,null,null,null,{"$f":"J2988+O2988","v":0}]
[null,null,null,null,null,null,null,null,null,null,null,null,null,null,null,{"$f":"J2989+O2989","v":0}]
[null,null,null,null,null,null,null,null,null,null,null,null,null,null,null,{"$f":"J2990+O2990","v":0}]
[null,null,null,null,null,null,null,null,null,null,null,null,null,null,null,{"$f":"J2991+O2991","v":0}]
[null,null,null,null,null,null,null,null,null,null,null,null,null,null,null,{"$f":"J2992+O2992","v":0}]
[null,null,null,null,null,null,null,null,null,null,null,null,null,null,null,{"$f":"J2993+O2993","v":0}]
[null,null,null,null,null,null,null,null,null,null,null,null,null,null,null,{"$f":"J2994+O2994","v":0}]
[null,null,null,null,null,null,null,null,null,null,null,null,null,null,null,{"$f":"J2995+O2995","v":0}]
[null,null,null,null,null,null,null,null,null,null,null,null,null,null,null,{"$f":"J2996+O2996","v":0}]
[null,null,null,null,null,null,null,null,null,null,null,null,null,null,null,{"$f":"J2997+O2997","v":0}]
[null,null,null,null,null,null,null,null,null,null,null,null,null,null,null,{"$f":"J2998+O2998","v":0}]
[null,null,null,null,null,null,null,null,null,null,null,null,null,null,null,{"$f":"J2999+O2999","v":0}]
[null,null,null,null,null,null,null,null,null,null,null,null,null,null,null,{"$f":"J3000+O3000","v":0}]
[null,null,null,null,null,null,null,null,null,null,null,null,null,null,null,{"$f":"J3001+O3001","v":0}]
[null,null,null,null,null,null,null,null,null,null,null,null,null,null,null,{"$f":"J3002+O3002","v":0}]
[null,null,null,null,null,null,null,null,null,null,null,null,null,null,null,{"$f":"J3003+O3003","v":0}]
[null,null,null,null,null,null,null,null,null,null,null,null,null,null,null,{"$f":"J3004+O3004","v":0}]
[null,null,null,null,null,null,null,null,null,null,null,null,null,null,null,{"$f":"J3005+O3005","v":0}]
[null,null,null,null,null,null,null,null,null,null,null,null,null,null,null,{"$f":"J3006+O3006","v":0}]
[null,null,null,null,null,null,null,null,null,null,null,null,null,null,null,{"$f":"J3007+O3007","v":0}]
[null,null,null,null,null,null,null,null,null,null,null,null,null,null,null,{"$f":"J3008+O3008","v":0}]
[null,null,null,null,null,null,null,null,null,null,null,null,null,null,null,{"$f":"J3009+O3009","v":0}]
[null,null,null,null,null,null,null,null,null,null,null,null,null,null,null,{"$f":"J3010+O3010","v":0}]
[null,null,null,null,null,null,null,null,null,null,null,null,null,null,null,{"$f":"J3011+O3011","v":0}]
[null,null,null,null,null,null,null,null,null,null,null,null,null,null,null,{"$f":"J3012+O3012","v":0}]
[null,null,null,null,null,null,null,null,null,null,null,null,null,null,null,{"$f":"J3013+O3013","v":0}]
[null,null,null,null,null,null,null,null,null,null,null,null,null,null,null,{"$f":"J3014+O3014","v":0}]
[null,null,null,null,null,null,null,null,null,null,null,null,null,null,null,{"$f":"J3015+O3015","v":0}]
[null,null,null,null,null,null,null,null,null,null,null,null,null,null,null,{"$f":"J3016+O3016","v":0}]
[null,null,null,null,null,null,null,null,null,null,null,null,null,null,null,{"$f":"J3017+O3017","v":0}]
[null,null,null,null,null,null,null,null,null,null,null,null,null,null,null,{"$f":"J3018+O3018","v":0}]
[null,null,null,null,null,null,null,null,null,null,null,null,null,null,null,{"$f":"J3019+O3019","v":0}]
[null,null,null,null,null,null,null,null,null,null,null,null,null,null,null,{"$f":"J3020+O3020","v":0}]
[null,null,null,null,null,null,null,null,null,null,null,null,null,null,null,{"$f":"J3021+O3021","v":0}]
[null,null,null,null,null,null,null,null,null,null,null,null,null,null,null,{"$f":"J3022+O3022","v":0}]
[null,null,null,null,null,null,null,null,null,null,null,null,null,null,null,{"$f":"J3023+O3023","v":0}]
[null,null,null,null,null,null,null,null,null,null,null,null,null,null,null,{"$f":"J3024+O3024","v":0}]
[null,null,null,null,null,null,null,null,null,null,null,null,null,null,null,{"$f":"J3025+O3025","v":0}]
[null,null,null,null,null,null,null,null,null,null,null,null,null,null,null,{"$f":"J3026+O3026","v":0}]
[null,null,null,null,null,null,null,null,null,null,null,null,null,null,null,{"$f":"J3027+O3027","v":0}]
[null,null,null,null,null,null,null,null,null,null,null,null,null,null,null,{"$f":"J3028+O3028","v":0}]
[null,null,null,null,null,null,null,null,null,null,null,null,null,null,null,{"$f":"J3029+O3029","v":0}]
[null,null,null,null,null,null,null,null,null,null,null,null,null,null,null,{"$f":"J3030+O3030","v":0}]
[null,null,null,null,null,null,null,null,null,null,null,null,null,null,null,{"$f":"J3031+O3031","v":0}]
[null,null,null,null,null,null,null,null,null,null,null,null,null,null,null,{"$f":"J3032+O3032","v":0}]
[null,null,null,null,null,null,null,null,null,null,null,null,null,null,null,{"$f":"J3033+O3033","v":0}]
[null,null,null,null,null,null,null,null,null,null,null,null,null,null,null,{"$f":"J3034+O3034","v":0}]
[null,null,null,null,null,null,null,null,null,null,null,null,null,null,null,{"$f":"J3035+O3035","v":0}]
[null,null,null,null,null,null,null,null,null,null,null,null,null,null,null,{"$f":"J3036+O3036","v":0}]
[null,null,null,null,null,null,null,null,null,null,null,null,null,null,null,{"$f":"J3037+O3037","v":0}]
[null,null,null,null,null,null,null,null,null,null,null,null,null,null,null,{"$f":"J3038+O3038","v":0}]
[null,null,null,null,null,null,null,null,null,null,null,null,null,null,null,{"$f":"J3039+O3039","v":0}]
[null,null,null,null,null,null,null,null,null,null,null,null,null,null,null,{"$f":"J3040+O3040","v":0}]
[null,null,null,null,null,null,null,null,null,null,null,null,null,null,null,{"$f":"J3041+O3041","v":0}]
[null,null,null,null,null,null,null,null,null,null,null,null,null,null,null,{"$f":"J3042+O3042","v":0}]
[null,null,null,null,null,null,null,null,null,null,null,null,null,null,null,{"$f":"J3043+O3043","v":0}]
[null,null,null,null,null,null,null,null,null,null,null,null,null,null,null,{"$f":"J3044+O3044","v":0}]
[null,null,null,null,null,null,null,null,null,null,null,null,null,null,null,{"$f":"J3045+O3045","v":0}]
[null,null,null,null,null,null,null,null,null,null,null,null,null,null,null,{"$f":"J3046+O3046","v":0}]
[null,null,null,null,null,null,null,null,null,null,null,null,null,null,null,{"$f":"J3047+O3047","v":0}]
[null,null,null,null,null,null,null,null,null,null,null,null,null,null,null,{"$f":"J3048+O3048","v":0}]
[null,null,null,null,null,null,null,null,null,null,null,null,null,null,null,{"$f":"J3049+O3049","v":0}]
[null,null,null,null,null,null,null,null,null,null,null,null,null,null,null,{"$f":"J3050+O3050","v":0}]
[null,null,null,null,null,null,null,null,null,null,null,null,null,null,null,{"$f":"J3051+O3051","v":0}]
[null,null,null,null,null,null,null,null,null,null,null,null,null,null,null,{"$f":"J3052+O3052","v":0}]
[null,null,null,null,null,null,null,null,null,null,null,null,null,null,null,{"$f":"J3053+O3053","v":0}]
[null,null,null,null,null,null,null,null,null,null,null,null,null,null,null,{"$f":"J3054+O3054","v":0}]
[null,null,null,null,null,null,null,null,null,null,null,null,null,null,null,{"$f":"J3055+O3055","v":0}]
[null,null,null,null,null,null,null,null,null,null,null,null,null,null,null,{"$f":"J3056+O3056","v":0}]
[null,null,null,null,null,null,null,null,null,null,null,null,null,null,null,{"$f":"J3057+O3057","v":0}]
[null,null,null,null,null,null,null,null,null,null,null,null,null,null,null,{"$f":"J3058+O3058","v":0}]
[null,null,null,null,null,null,null,null,null,null,null,null,null,null,null,{"$f":"J3059+O3059","v":0}]
[null,null,null,null,null,null,null,null,null,null,null,null,null,null,null,{"$f":"J3060+O3060","v":0}]
[null,null,null,null,null,null,null,null,null,null,null,null,null,null,null,{"$f":"J3061+O3061","v":0}]
[null,null,null,null,null,null,null,null,null,null,null,null,null,null,null,{"$f":"J3062+O3062","v":0}]
[null,null,null,null,null,null,null,null,null,null,null,null,null,null,null,{"$f":"J3063+O3063","v":0}]
[null,null,null,null,null,null,null,null,null,null,null,null,null,null,null,{"$f":"J3064+O3064","v":0}]
[null,null,null,null,null,null,null,null,null,null,null,null,null,null,null,{"$f":"J3065+O3065","v":0}]
[null,null,null,null,null,null,null,null,null,null,null,null,null,null,null,{"$f":"J3066+O3066","v":0}]
[null,null,null,null,null,null,null,null,null,null,null,null,null,null,null,{"$f":"J3067+O3067","v":0}]
[null,null,null,null,null,null,null,null,null,null,null,null,null,null,null,{"$f":"J3068+O3068","v":0}]
[null,null,null,null,null,null,null,null,null,null,null,null,null,null,null,{"$f":"J3069+O3069","v":0}]
[null,null,null,null,null,null,null,null,null,null,null,null,null,null,null,{"$f":"J3070+O3070","v":0}]
[null,null,null,null,null,null,null,null,null,null,null,null,null,null,null,{"$f":"J3071+O3071","v":0}]
[null,null,null,null,null,null,null,null,null,null,null,null,null,null,null,{"$f":"J3072+O3072","v":0}]
[null,null,null,null,null,null,null,null,null,null,null,null,null,null,null,{"$f":"J3073+O3073","v":0}]
[null,null,null,null,null,null,null,null,null,null,null,null,null,null,null,{"$f":"J3074+O3074","v":0}]
[null,null,null,null,null,null,null,null,null,null,null,null,null,null,null,{"$f":"J3075+O3075","v":0}]
[null,null,null,null,null,null,null,null,null,null,null,null,null,null,null,{"$f":"J3076+O3076","v":0}]
[null,null,null,null,null,null,null,null,null,null,null,null,null,null,null,{"$f":"J3077+O3077","v":0}]
[null,null,null,null,null,null,null,null,null,null,null,null,null,null,null,{"$f":"J3078+O3078","v":0}]
[null,null,null,null,null,null,null,null,null,null,null,null,null,null,null,{"$f":"J3079+O3079","v":0}]
[null,null,null,null,null,null,null,null,null,null,null,null,null,null,null,{"$f":"J3080+O3080","v":0}]
[null,null,null,null,null,null,null,null,null,null,null,null,null,null,null,{"$f":"J3081+O3081","v":0}]
[null,null,null,null,null,null,null,null,null,null,null,null,null,null,null,{"$f":"J3082+O3082","v":0}]
[null,null,null,null,null,null,null,null,null,null,null,null,null,null,null,{"$f":"J3083+O3083","v":0}]
[null,null,null,null,null,null,null,null,null,null,null,null,null,null,null,{"$f":"J3084+O3084","v":0}]
[null,null,null,null,null,null,null,null,null,null,null,null,null,null,null,{"$f":"J3085+O3085","v":0}]
[null,null,null,null,null,null,null,null,null,null,null,null,null,null,null,{"$f":"J3086+O3086","v":0}]
[null,null,null,null,null,null,null,null,null,null,null,null,null,null,null,{"$f":"J3087+O3087","v":0}]
[null,null,null,null,null,null,null,null,null,null,null,null,null,null,null,{"$f":"J3088+O3088","v":0}]
[null,null,null,null,null,null,null,null,null,null,null,null,null,null,null,{"$f":"J3089+O3089","v":0}]
[null,null,null,null,null,null,null,null,null,null,null,null,null,null,null,{"$f":"J3090+O3090","v":0}]
[null,null,null,null,null,null,null,null,null,null,null,null,null,null,null,{"$f":"J3091+O3091","v":0}]
[null,null,null,null,null,null,null,null,null,null,null,null,null,null,null,{"$f":"J3092+O3092","v":0}]
[null,null,null,null,null,null,null,null,null,null,null,null,null,null,null,{"$f":"J3093+O3093","v":0}]
[null,null,null,null,null,null,null,null,null,null,null,null,null,null,null,{"$f":"J3094+O3094","v":0}]
[null,null,null,null,null,null,null,null,null,null,null,null,null,null,null,{"$f":"J3095+O3095","v":0}]
[null,null,null,null,null,null,null,null,null,null,null,null,null,null,null,{"$f":"J3096+O3096","v":0}]
[null,null,null,null,null,null,null,null,null,null,null,null,null,null,null,{"$f":"J3097+O3097","v":0}]
[null,null,null,null,null,null,null,null,null,null,null,null,null,null,null,{"$f":"J3098+O3098","v":0}]
[null,null,null,null,null,null,null,null,null,null,null,null,null,null,null,{"$f":"J3099+O3099","v":0}]
[null,null,null,null,null,null,null,null,null,null,null,null,null,null,null,{"$f":"J3100+O3100","v":0}]
[null,null,null,null,null,null,null,null,null,null,null,null,null,null,null,{"$f":"J3101+O3101","v":0}]
[null,null,null,null,null,null,null,null,null,null,null,null,null,null,null,{"$f":"J3102+O3102","v":0}]
[null,null,null,null,null,null,null,null,null,null,null,null,null,null,null,{"$f":"J3103+O3103","v":0}]
[null,null,null,null,null,null,null,null,null,null,null,null,null,null,null,{"$f":"J3104+O3104","v":0}]
[null,null,null,null,null,null,null,null,null,null,null,null,null,null,null,{"$f":"J3105+O3105","v":0}]
[null,null,null,null,null,null,null,null,null,null,null,null,null,null,null,{"$f":"J3106+O3106","v":0}]
[null,null,null,null,null,null,null,null,null,null,null,null,null,null,null,{"$f":"J3107+O3107","v":0}]
[null,null,null,null,null,null,null,null,null,null,null,null,null,null,null,{"$f":"J3108+O3108","v":0}]
[null,null,null,null,null,null,null,null,null,null,null,null,null,null,null,{"$f":"J3109+O3109","v":0}]
[null,null,null,null,null,null,null,null,null,null,null,null,null,null,null,{"$f":"J3110+O3110","v":0}]
[null,null,null,null,null,null,null,null,null,null,null,null,null,null,null,{"$f":"J3111+O3111","v":0}]
[null,null,null,null,null,null,null,null,null,null,null,null,null,null,null,{"$f":"J3112+O3112","v":0}]
[null,null,null,null,null,null,null,null,null,null,null,null,null,null,null,{"$f":"J3113+O3113","v":0}]
[null,null,null,null,null,null,null,null,null,null,null,null,null,null,null,{"$f":"J3114+O3114","v":0}]
[null,null,null,null,null,null,null,null,null,null,null,null,null,null,null,{"$f":"J3115+O3115","v":0}]
[null,null,null,null,null,null,null,null,null,null,null,null,null,null,null,{"$f":"J3116+O3116","v":0}]
[null,null,null,null,null,null,null,null,null,null,null,null,null,null,null,{"$f":"J3117+O3117","v":0}]
[null,null,null,null,null,null,null,null,null,null,null,null,null,null,null,{"$f":"J3118+O3118","v":0}]
[null,null,null,null,null,null,null,null,null,null,null,null,null,null,null,{"$f":"J3119+O3119","v":0}]
[null,null,null,null,null,null,null,null,null,null,null,null,null,null,null,{"$f":"J3120+O3120","v":0}]
[null,null,null,null,null,null,null,null,null,null,null,null,null,null,null,{"$f":"J3121+O3121","v":0}]
[null,null,null,null,null,null,null,null,null,null,null,null,null,null,null,{"$f":"J3122+O3122","v":0}]
[null,null,null,null,null,null,null,null,null,null,null,null,null,null,null,{"$f":"J3123+O3123","v":0}]
[null,null,null,null,null,null,null,null,null,null,null,null,null,null,null,{"$f":"J3124+O3124","v":0}]
[null,null,null,null,null,null,null,null,null,null,null,null,null,null,null,{"$f":"J3125+O3125","v":0}]
[null,null,null,null,null,null,null,null,null,null,null,null,null,null,null,{"$f":"J3126+O3126","v":0}]
[null,null,null,null,null,null,null,null,null,null,null,null,null,null,null,{"$f":"J3127+O3127","v":0}]
[null,null,null,null,null,null,null,null,null,null,null,null,null,null,null,{"$f":"J3128+O3128","v":0}]
[null,null,null,null,null,null,null,null,null,null,null,null,null,null,null,{"$f":"J3129+O3129","v":0}]
[null,null,null,null,null,null,null,null,null,null,null,null,null,null,null,{"$f":"J3130+O3130","v":0}]
[null,null,null,null,null,null,null,null,null,null,null,null,null,null,null,{"$f":"J3131+O3131","v":0}]
[null,null,null,null,null,null,null,null,null,null,null,null,null,null,null,{"$f":"J3132+O3132","v":0}]
[null,null,null,null,null,null,null,null,null,null,null,null,null,null,null,{"$f":"J3133+O3133","v":0}]
[null,null,null,null,null,null,null,null,null,null,null,null,null,null,null,{"$f":"J3134+O3134","v":0}]
[null,null,null,null,null,null,null,null,null,null,null,null,null,null,null,{"$f":"J3135+O3135","v":0}]
[null,null,null,null,null,null,null,null,null,null,null,null,null,null,null,{"$f":"J3136+O3136","v":0}]
[null,null,null,null,null,null,null,null,null,null,null,null,null,null,null,{"$f":"J3137+O3137","v":0}]
[null,null,null,null,null,null,null,null,null,null,null,null,null,null,null,{"$f":"J3138+O3138","v":0}]
[null,null,null,null,null,null,null,null,null,null,null,null,null,null,null,{"$f":"J3139+O3139","v":0}]
[null,null,null,null,null,null,null,null,null,null,null,null,null,null,null,{"$f":"J3140+O3140","v":0}]
[null,null,null,null,null,null,null,null,null,null,null,null,null,null,null,{"$f":"J3141+O3141","v":0}]
[null,null,null,null,null,null,null,null,null,null,null,null,null,null,null,{"$f":"J3142+O3142","v":0}]
[null,null,null,null,null,null,null,null,null,null,null,null,null,null,null,{"$f":"J3143+O3143","v":0}]
[null,null,null,null,null,null,null,null,null,null,null,null,null,null,null,{"$f":"J3144+O3144","v":0}]
[null,null,null,null,null,null,null,null,null,null,null,null,null,null,null,{"$f":"J3145+O3145","v":0}]
[null,null,null,null,null,null,null,null,null,null,null,null,null,null,null,{"$f":"J3146+O3146","v":0}]
[null,null,null,null,null,null,null,null,null,null,null,null,null,null,null,{"$f":"J3147+O3147","v":0}]
[null,null,null,null,null,null,null,null,null,null,null,null,null,null,null,{"$f":"J3148+O3148","v":0}]
[null,null,null,null,null,null,null,null,null,null,null,null,null,null,null,{"$f":"J3149+O3149","v":0}]
[null,null,null,null,null,null,null,null,null,null,null,null,null,null,null,{"$f":"J3150+O3150","v":0}]
[null,null,null,null,null,null,null,null,null,null,null,null,null,null,null,{"$f":"J3151+O3151","v":0}]
[null,null,null,null,null,null,null,null,null,null,null,null,null,null,null,{"$f":"J3152+O3152","v":0}]
[null,null,null,null,null,null,null,null,null,null,null,null,null,null,null,{"$f":"J3153+O3153","v":0}]
[null,null,null,null,null,null,null,null,null,null,null,null,null,null,null,{"$f":"J3154+O3154","v":0}]
[null,null,null,null,null,null,null,null,null,null,null,null,null,null,null,{"$f":"J3155+O3155","v":0}]
[null,null,null,null,null,null,null,null,null,null,null,null,null,null,null,{"$f":"J3156+O3156","v":0}]
[null,null,null,null,null,null,null,null,null,null,null,null,null,null,null,{"$f":"J3157+O3157","v":0}]
[null,null,null,null,null,null,null,null,null,null,null,null,null,null,null,{"$f":"J3158+O3158","v":0}]
[null,null,null,null,null,null,null,null,null,null,null,null,null,null,null,{"$f":"J3159+O3159","v":0}]
[null,null,null,null,null,null,null,null,null,null,null,null,null,null,null,{"$f":"J3160+O3160","v":0}]
[null,null,null,null,null,null,null,null,null,null,null,null,null,null,null,{"$f":"J3161+O3161","v":0}]
[null,null,null,null,null,null,null,null,null,null,null,null,null,null,null,{"$f":"J3162+O3162","v":0}]
[null,null,null,null,null,null,null,null,null,null,null,null,null,null,null,{"$f":"J3163+O3163","v":0}]
[null,null,null,null,null,null,null,null,null,null,null,null,null,null,null,{"$f":"J3164+O3164","v":0}]
[null,null,null,null,null,null,null,null,null,null,null,null,null,null,null,{"$f":"J3165+O3165","v":0}]
[null,null,null,null,null,null,null,null,null,null,null,null,null,null,null,{"$f":"J3166+O3166","v":0}]
[null,null,null,null,null,null,null,null,null,null,null,null,null,null,null,{"$f":"J3167+O3167","v":0}]
[null,null,null,null,null,null,null,null,null,null,null,null,null,null,null,{"$f":"J3168+O3168","v":0}]
[null,null,null,null,null,null,null,null,null,null,null,null,null,null,null,{"$f":"J3169+O3169","v":0}]
[null,null,null,null,null,null,null,null,null,null,null,null,null,null,null,{"$f":"J3170+O3170","v":0}]
[null,null,null,null,null,null,null,null,null,null,null,null,null,null,null,{"$f":"J3171+O3171","v":0}]
[null,null,null,null,null,null,null,null,null,null,null,null,null,null,null,{"$f":"J3172+O3172","v":0}]
[null,null,null,null,null,null,null,null,null,null,null,null,null,null,null,{"$f":"J3173+O3173","v":0}]
[null,null,null,null,null,null,null,null,null,null,null,null,null,null,null,{"$f":"J3174+O3174","v":0}]
[null,null,null,null,null,null,null,null,null,null,null,null,null,null,null,{"$f":"J3175+O3175","v":0}]
[null,null,null,null,null,null,null,null,null,null,null,null,null,null,null,{"$f":"J3176+O3176","v":0}]
[null,null,null,null,null,null,null,null,null,null,null,null,null,null,null,{"$f":"J3177+O3177","v":0}]
[null,null,null,null,null,null,null,null,null,null,null,null,null,null,null,{"$f":"J3178+O3178","v":0}]
[null,null,null,null,null,null,null,null,null,null,null,null,null,null,null,{"$f":"J3179+O3179","v":0}]
[null,null,null,null,null,null,null,null,null,null,null,null,null,null,null,{"$f":"J3180+O3180","v":0}]
[null,null,null,null,null,null,null,null,null,null,null,null,null,null,null,{"$f":"J3181+O3181","v":0}]
[null,null,null,null,null,null,null,null,null,null,null,null,null,null,null,{"$f":"J3182+O3182","v":0}]
[null,null,null,null,null,null,null,null,null,null,null,null,null,null,null,{"$f":"J3183+O3183","v":0}]
[null,null,null,null,null,null,null,null,null,null,null,null,null,null,null,{"$f":"J3184+O3184","v":0}]
[null,null,null,null,null,null,null,null,null,null,null,null,null,null,null,{"$f":"J3185+O3185","v":0}]
[null,null,null,null,null,null,null,null,null,null,null,null,null,null,null,{"$f":"J3186+O3186","v":0}]
[null,null,null,null,null,null,null,null,null,null,null,null,null,null,null,{"$f":"J3187+O3187","v":0}]
[null,null,null,null,null,null,null,null,null,null,null,null,null,null,null,{"$f":"J3188+O3188","v":0}]
[null,null,null,null,null,null,null,null,null,null,null,null,null,null,null,{"$f":"J3189+O3189","v":0}]
[null,null,null,null,null,null,null,null,null,null,null,null,null,null,null,{"$f":"J3190+O3190","v":0}]
[null,null,null,null,null,null,null,null,null,null,null,null,null,null,null,{"$f":"J3191+O3191","v":0}]
[null,null,null,null,null,null,null,null,null,null,null,null,null,null,null,{"$f":"J3192+O3192","v":0}]
[null,null,null,null,null,null,null,null,null,null,null,null,null,null,null,{"$f":"J3193+O3193","v":0}]
[null,null,null,null,null,null,null,null,null,null,null,null,null,null,null,{"$f":"J3194+O3194","v":0}]
[null,null,null,null,null,null,null,null,null,null,null,null,null,null,null,{"$f":"J3195+O3195","v":0}]
[null,null,null,null,null,null,null,null,null,null,null,null,null,null,null,{"$f":"J3196+O3196","v":0}]
[null,null,null,null,null,null,null,null,null,null,null,null,null,null,null,{"$f":"J3197+O3197","v":0}]
[null,null,null,null,null,null,null,null,null,null,null,null,null,null,null,{"$f":"J3198+O3198","v":0}]
[null,null,null,null,null,null,null,null,null,null,null,null,null,null,null,{"$f":"J3199+O3199","v":0}]
[null,null,null,null,null,null,null,null,null,null,null,null,null,null,null,{"$f":"J3200+O3200","v":0}]
[null,null,null,null,null,null,null,null,null,null,null,null,null,null,null,{"$f":"J3201+O3201","v":0}]
[null,null,null,null,null,null,null,null,null,null,null,null,null,null,null,{"$f":"J3202+O3202","v":0}]
[null,null,null,null,null,null,null,null,null,null,null,null,null,null,null,{"$f":"J3203+O3203","v":0}]
[null,null,null,null,null,null,null,null,null,null,null,null,null,null,null,{"$f":"J3204+O3204","v":0}]
[null,null,null,null,null,null,null,null,null,null,null,null,null,null,null,{"$f":"J3205+O3205","v":0}]
[null,null,null,null,null,null,null,null,null,null,null,null,null,null,null,{"$f":"J3206+O3206","v":0}]
[null,null,null,null,null,null,null,null,null,null,null,null,null,null,null,{"$f":"J3207+O3207","v":0}]
[null,null,null,null,null,null,null,null,null,null,null,null,null,null,null,{"$f":"J3208+O3208","v":0}]
[null,null,null,null,null,null,null,null,null,null,null,null,null,null,null,{"$f":"J3209+O3209","v":0}]
[null,null,null,null,null,null,null,null,null,null,null,null,null,null,null,{"$f":"J3210+O3210","v":0}]
[null,null,null,null,null,null,null,null,null,null,null,null,null,null,null,{"$f":"J3211+O3211","v":0}]
[null,null,null,null,null,null,null,null,null,null,null,null,null,null,null,{"$f":"J3212+O3212","v":0}]
[null,null,null,null,null,null,null,null,null,null,null,null,null,null,null,{"$f":"J3213+O3213","v":0}]
[null,null,null,null,null,null,null,null,null,null,null,null,null,null,null,{"$f":"J3214+O3214","v":0}]
[null,null,null,null,null,null,null,null,null,null,null,null,null,null,null,{"$f":"J3215+O3215","v":0}]
[null,null,null,null,null,null,null,null,null,null,null,null,null,null,null,{"$f":"J3216+O3216","v":0}]
[null,null,null,null,null,null,null,null,null,null,null,null,null,null,null,{"$f":"J3217+O3217","v":0}]
[null,null,null,null,null,null,null,null,null,null,null,null,null,null,null,{"$f":"J3218+O3218","v":0}]
[null,null,null,null,null,null,null,null,null,null,null,null,null,null,null,{"$f":"J3219+O3219","v":0}]
[null,null,null,null,null,null,null,null,null,null,null,null,null,null,null,{"$f":"J3220+O3220","v":0}]
[null,null,null,null,null,null,null,null,null,null,null,null,null,null,null,{"$f":"J3221+O3221","v":0}]
[null,null,null,null,null,null,null,null,null,null,null,null,null,null,null,{"$f":"J3222+O3222","v":0}]
[null,null,null,null,null,null,null,null,null,null,null,null,null,null,null,{"$f":"J3223+O3223","v":0}]
[null,null,null,null,null,null,null,null,null,null,null,null,null,null,null,{"$f":"J3224+O3224","v":0}]
[null,null,null,null,null,null,null,null,null,null,null,null,null,null,null,{"$f":"J3225+O3225","v":0}]
[null,null,null,null,null,null,null,null,null,null,null,null,null,null,null,{"$f":"J3226+O3226","v":0}]
[null,null,null,null,null,null,null,null,null,null,null,null,null,null,null,{"$f":"J3227+O3227","v":0}]
[null,null,null,null,null,null,null,null,null,null,null,null,null,null,null,{"$f":"J3228+O3228","v":0}]
[null,null,null,null,null,null,null,null,null,null,null,null,null,null,null,{"$f":"J3229+O3229","v":0}]
[null,null,null,null,null,null,null,null,null,null,null,null,null,null,null,{"$f":"J3230+O3230","v":0}]
[null,null,null,null,null,null,null,null,null,null,null,null,null,null,null,{"$f":"J3231+O3231","v":0}]
[null,null,null,null,null,null,null,null,null,null,null,null,null,null,null,{"$f":"J3232+O3232","v":0}]
[null,null,null,null,null,null,null,null,null,null,null,null,null,null,null,{"$f":"J3233+O3233","v":0}]
[null,null,null,null,null,null,null,null,null,null,null,null,null,null,null,{"$f":"J3234+O3234","v":0}]
[null,null,null,null,null,null,null,null,null,null,null,null,null,null,null,{"$f":"J3235+O3235","v":0}]
[null,null,null,null,null,null,null,null,null,null,null,null,null,null,null,{"$f":"J3236+O3236","v":0}]
[null,null,null,null,null,null,null,null,null,null,null,null,null,null,null,{"$f":"J3237+O3237","v":0}]
[null,null,null,null,null,null,null,null,null,null,null,null,null,null,null,{"$f":"J3238+O3238","v":0}]
[null,null,null,null,null,null,null,null,null,null,null,null,null,null,null,{"$f":"J3239+O3239","v":0}]
[null,null,null,null,null,null,null,null,null,null,null,null,null,null,null,{"$f":"J3240+O3240","v":0}]
[null,null,null,null,null,null,null,null,null,null,null,null,null,null,null,{"$f":"J3241+O3241","v":0}]
[null,null,null,null,null,null,null,null,null,null,null,null,null,null,null,{"$f":"J3242+O3242","v":0}]
[null,null,null,null,null,null,null,null,null,null,null,null,null,null,null,{"$f":"J3243+O3243","v":0}]
[null,null,null,null,null,null,null,null,null,null,null,null,null,null,null,{"$f":"J3244+O3244","v":0}]
[null,null,null,null,null,null,null,null,null,null,null,null,null,null,null,{"$f":"J3245+O3245","v":0}]
[null,null,null,null,null,null,null,null,null,null,null,null,null,null,null,{"$f":"J3246+O3246","v":0}]
[null,null,null,null,null,null,null,null,null,null,null,null,null,null,null,{"$f":"J3247+O3247","v":0}]
[null,null,null,null,null,null,null,null,null,null,null,null,null,null,null,{"$f":"J3248+O3248","v":0}]
[null,null,null,null,null,null,null,null,null,null,null,null,null,null,null,{"$f":"J3249+O3249","v":0}]
[null,null,null,null,null,null,null,null,null,null,null,null,null,null,null,{"$f":"J3250+O3250","v":0}]
[null,null,null,null,null,null,null,null,null,null,null,null,null,null,null,{"$f":"J3251+O3251","v":0}]
[null,null,null,null,null,null,null,null,null,null,null,null,null,null,null,{"$f":"J3252+O3252","v":0}]
[null,null,null,null,null,null,null,null,null,null,null,null,null,null,null,{"$f":"J3253+O3253","v":0}]
[null,null,null,null,null,null,null,null,null,null,null,null,null,null,null,{"$f":"J3254+O3254","v":0}]
[null,null,null,null,null,null,null,null,null,null,null,null,null,null,null,{"$f":"J3255+O3255","v":0}]
[null,null,null,null,null,null,null,null,null,null,null,null,null,null,null,{"$f":"J3256+O3256","v":0}]
[null,null,null,null,null,null,null,null,null,null,null,null,null,null,null,{"$f":"J3257+O3257","v":0}]
[null,null,null,null,null,null,null,null,null,null,null,null,null,null,null,{"$f":"J3258+O3258","v":0}]
[null,null,null,null,null,null,null,null,null,null,null,null,null,null,null,{"$f":"J3259+O3259","v":0}]
[null,null,null,null,null,null,null,null,null,null,null,null,null,null,null,{"$f":"J3260+O3260","v":0}]
[null,null,null,null,null,null,null,null,null,null,null,null,null,null,null,{"$f":"J3261+O3261","v":0}]
[null,null,null,null,null,null,null,null,null,null,null,null,null,null,null,{"$f":"J3262+O3262","v":0}]
[null,null,null,null,null,null,null,null,null,null,null,null,null,null,null,{"$f":"J3263+O3263","v":0}]
[null,null,null,null,null,null,null,null,null,null,null,null,null,null,null,{"$f":"J3264+O3264","v":0}]
[null,null,null,null,null,null,null,null,null,null,null,null,null,null,null,{"$f":"J3265+O3265","v":0}]
[null,null,null,null,null,null,null,null,null,null,null,null,null,null,null,{"$f":"J3266+O3266","v":0}]
[null,null,null,null,null,null,null,null,null,null,null,null,null,null,null,{"$f":"J3267+O3267","v":0}]
[null,null,null,null,null,null,null,null,null,null,null,null,null,null,null,{"$f":"J3268+O3268","v":0}]
[null,null,null,null,null,null,null,null,null,null,null,null,null,null,null,{"$f":"J3269+O3269","v":0}]
[null,null,null,null,null,null,null,null,null,null,null,null,null,null,null,{"$f":"J3270+O3270","v":0}]
[null,null,null,null,null,null,null,null,null,null,null,null,null,null,null,{"$f":"J3271+O3271","v":0}]
[null,null,null,null,null,null,null,null,null,null,null,null,null,null,null,{"$f":"J3272+O3272","v":0}]
[null,null,null,null,null,null,null,null,null,null,null,null,null,null,null,{"$f":"J3273+O3273","v":0}]
[null,null,null,null,null,null,null,null,null,null,null,null,null,null,null,{"$f":"J3274+O3274","v":0}]
[null,null,null,null,null,null,null,null,null,null,null,null,null,null,null,{"$f":"J3275+O3275","v":0}]
[null,null,null,null,null,null,null,null,null,null,null,null,null,null,null,{"$f":"J3276+O3276","v":0}]
[null,null,null,null,null,null,null,null,null,null,null,null,null,null,null,{"$f":"J3277+O3277","v":0}]
[null,null,null,null,null,null,null,null,null,null,null,null,null,null,null,{"$f":"J3278+O3278","v":0}]
[null,null,null,null,null,null,null,null,null,null,null,null,null,null,null,{"$f":"J3279+O3279","v":0}]
[null,null,null,null,null,null,null,null,null,null,null,null,null,null,null,{"$f":"J3280+O3280","v":0}]
[null,null,null,null,null,null,null,null,null,null,null,null,null,null,null,{"$f":"J3281+O3281","v":0}]
[null,null,null,null,null,null,null,null,null,null,null,null,null,null,null,{"$f":"J3282+O3282","v":0}]
[null,null,null,null,null,null,null,null,null,null,null,null,null,null,null,{"$f":"J3283+O3283","v":0}]
[null,null,null,null,null,null,null,null,null,null,null,null,null,null,null,{"$f":"J3284+O3284","v":0}]
[null,null,null,null,null,null,null,null,null,null,null,null,null,null,null,{"$f":"J3285+O3285","v":0}]
[null,null,null,null,null,null,null,null,null,null,null,null,null,null,null,{"$f":"J3286+O3286","v":0}]
[null,null,null,null,null,null,null,null,null,null,null,null,null,null,null,{"$f":"J3287+O3287","v":0}]
[null,null,null,null,null,null,null,null,null,null,null,null,null,null,null,{"$f":"J3288+O3288","v":0}]
[null,null,null,null,null,null,null,null,null,null,null,null,null,null,null,{"$f":"J3289+O3289","v":0}]
[null,null,null,null,null,null,null,null,null,null,null,null,null,null,null,{"$f":"J3290+O3290","v":0}]
[null,null,null,null,null,null,null,null,null,null,null,null,null,null,null,{"$f":"J3291+O3291","v":0}]
[null,null,null,null,null,null,null,null,null,null,null,null,null,null,null,{"$f":"J3292+O3292","v":0}]
[null,null,null,null,null,null,null,null,null,null,null,null,null,null,null,{"$f":"J3293+O3293","v":0}]
[null,null,null,null,null,null,null,null,null,null,null,null,null,null,null,{"$f":"J3294+O3294","v":0}]
[null,null,null,null,null,null,null,null,null,null,null,null,null,null,null,{"$f":"J3295+O3295","v":0}]
[null,null,null,null,null,null,null,null,null,null,null,null,null,null,null,{"$f":"J3296+O3296","v":0}]
[null,null,null,null,null,null,null,null,null,null,null,null,null,null,null,{"$f":"J3297+O3297","v":0}]
[null,null,null,null,null,null,null,null,null,null,null,null,null,null,null,{"$f":"J3298+O3298","v":0}]
[null,null,null,null,null,null,null,null,null,null,null,null,null,null,null,{"$f":"J3299+O3299","v":0}]
[null,null,null,null,null,null,null,null,null,null,null,null,null,null,null,{"$f":"J3300+O3300","v":0}]
[null,null,null,null,null,null,null,null,null,null,null,null,null,null,null,{"$f":"J3301+O3301","v":0}]
[null,null,null,null,null,null,null,null,null,null,null,null,null,null,null,{"$f":"J3302+O3302","v":0}]
[null,null,null,null,null,null,null,null,null,null,null,null,null,null,null,{"$f":"J3303+O3303","v":0}]
[null,null,null,null,null,null,null,null,null,null,null,null,null,null,null,{"$f":"J3304+O3304","v":0}]
[null,null,null,null,null,null,null,null,null,null,null,null,null,null,null,{"$f":"J3305+O3305","v":0}]
[null,null,null,null,null,null,null,null,null,null,null,null,null,null,null,{"$f":"J3306+O3306","v":0}]
[null,null,null,null,null,null,null,null,null,null,null,null,null,null,null,{"$f":"J3307+O3307","v":0}]
[null,null,null,null,null,null,null,null,null,null,null,null,null,null,null,{"$f":"J3308+O3308","v":0}]
[null,null,null,null,null,null,null,null,null,null,null,null,null,null,null,{"$f":"J3309+O3309","v":0}]
[null,null,null,null,null,null,null,null,null,null,null,null,null,null,null,{"$f":"J3310+O3310","v":0}]
[null,null,null,null,null,null,null,null,null,null,null,null,null,null,null,{"$f":"J3311+O3311","v":0}]
[null,null,null,null,null,null,null,null,null,null,null,null,null,null,null,{"$f":"J3312+O3312","v":0}]
[null,null,null,null,null,null,null,null,null,null,null,null,null,null,null,{"$f":"J3313+O3313","v":0}]
[null,null,null,null,null,null,null,null,null,null,null,null,null,null,null,{"$f":"J3314+O3314","v":0}]
[null,null,null,null,null,null,null,null,null,null,null,null,null,null,null,{"$f":"J3315+O3315","v":0}]
[null,null,null,null,null,null,null,null,null,null,null,null,null,null,null,{"$f":"J3316+O3316","v":0}]
[null,null,null,null,null,null,null,null,null,null,null,null,null,null,null,{"$f":"J3317+O3317","v":0}]
[null,null,null,null,null,null,null,null,null,null,null,null,null,null,null,{"$f":"J3318+O3318","v":0}]
[null,null,null,null,null,null,null,null,null,null,null,null,null,null,null,{"$f":"J3319+O3319","v":0}]
[null,null,null,null,null,null,null,null,null,null,null,null,null,null,null,{"$f":"J3320+O3320","v":0}]
[null,null,null,null,null,null,null,null,null,null,null,null,null,null,null,{"$f":"J3321+O3321","v":0}]
[null,null,null,null,null,null,null,null,null,null,null,null,null,null,null,{"$f":"J3322+O3322","v":0}]
[null,null,null,null,null,null,null,null,null,null,null,null,null,null,null,{"$f":"J3323+O3323","v":0}]
[null,null,null,null,null,null,null,null,null,null,null,null,null,null,null,{"$f":"J3324+O3324","v":0}]
[null,null,null,null,null,null,null,null,null,null,null,null,null,null,null,{"$f":"J3325+O3325","v":0}]
[null,null,null,null,null,null,null,null,null,null,null,null,null,null,null,{"$f":"J3326+O3326","v":0}]
[null,null,null,null,null,null,null,null,null,null,null,null,null,null,null,{"$f":"J3327+O3327","v":0}]
[null,null,null,null,null,null,null,null,null,null,null,null,null,null,null,{"$f":"J3328+O3328","v":0}]
[null,null,null,null,null,null,null,null,null,null,null,null,null,null,null,{"$f":"J3329+O3329","v":0}]
[null,null,null,null,null,null,null,null,null,null,null,null,null,null,null,{"$f":"J3330+O3330","v":0}]
[null,null,null,null,null,null,null,null,null,null,null,null,null,null,null,{"$f":"J3331+O3331","v":0}]
[null,null,null,null,null,null,null,null,null,null,null,null,null,null,null,{"$f":"J3332+O3332","v":0}]
[null,null,null,null,null,null,null,null,null,null,null,null,null,null,null,{"$f":"J3333+O3333","v":0}]
[null,null,null,null,null,null,null,null,null,null,null,null,null,null,null,{"$f":"J3334+O3334","v":0}]
[null,null,null,null,null,null,null,null,null,null,null,null,null,null,null,{"$f":"J3335+O3335","v":0}]
[null,null,null,null,null,null,null,null,null,null,null,null,null,null,null,{"$f":"J3336+O3336","v":0}]
[null,null,null,null,null,null,null,null,null,null,null,null,null,null,null,{"$f":"J3337+O3337","v":0}]
[null,null,null,null,null,null,null,null,null,null,null,null,null,null,null,{"$f":"J3338+O3338","v":0}]
[null,null,null,null,null,null,null,null,null,null,null,null,null,null,null,{"$f":"J3339+O3339","v":0}]
[null,null,null,null,null,null,null,null,null,null,null,null,null,null,null,{"$f":"J3340+O3340","v":0}]
[null,null,null,null,null,null,null,null,null,null,null,null,null,null,null,{"$f":"J3341+O3341","v":0}]
[null,null,null,null,null,null,null,null,null,null,null,null,null,null,null,{"$f":"J3342+O3342","v":0}]
[null,null,null,null,null,null,null,null,null,null,null,null,null,null,null,{"$f":"J3343+O3343","v":0}]
[null,null,null,null,null,null,null,null,null,null,null,null,null,null,null,{"$f":"J3344+O3344","v":0}]
[null,null,null,null,null,null,null,null,null,null,null,null,null,null,null,{"$f":"J3345+O3345","v":0}]
[null,null,null,null,null,null,null,null,null,null,null,null,null,null,null,{"$f":"J3346+O3346","v":0}]
[null,null,null,null,null,null,null,null,null,null,null,null,null,null,null,{"$f":"J3347+O3347","v":0}]
[null,null,null,null,null,null,null,null,null,null,null,null,null,null,null,{"$f":"J3348+O3348","v":0}]
[null,null,null,null,null,null,null,null,null,null,null,null,null,null,null,{"$f":"J3349+O3349","v":0}]
[null,null,null,null,null,null,null,null,null,null,null,null,null,null,null,{"$f":"J3350+O3350","v":0}]
[null,null,null,null,null,null,null,null,null,null,null,null,null,null,null,{"$f":"J3351+O3351","v":0}]
[null,null,null,null,null,null,null,null,null,null,null,null,null,null,null,{"$f":"J3352+O3352","v":0}]
[null,null,null,null,null,null,null,null,null,null,null,null,null,null,null,{"$f":"J3353+O3353","v":0}]
[null,null,null,null,null,null,null,null,null,null,null,null,null,null,null,{"$f":"J3354+O3354","v":0}]
[null,null,null,null,null,null,null,null,null,null,null,null,null,null,null,{"$f":"J3355+O3355","v":0}]
[null,null,null,null,null,null,null,null,null,null,null,null,null,null,null,{"$f":"J3356+O3356","v":0}]
[null,null,null,null,null,null,null,null,null,null,null,null,null,null,null,{"$f":"J3357+O3357","v":0}]
[null,null,null,null,null,null,null,null,null,null,null,null,null,null,null,{"$f":"J3358+O3358","v":0}]
[null,null,null,null,null,null,null,null,null,null,null,null,null,null,null,{"$f":"J3359+O3359","v":0}]
[null,null,null,null,null,null,null,null,null,null,null,null,null,null,null,{"$f":"J3360+O3360","v":0}]
[null,null,null,null,null,null,null,null,null,null,null,null,null,null,null,{"$f":"J3361+O3361","v":0}]
[null,null,null,null,null,null,null,null,null,null,null,null,null,null,null,{"$f":"J3362+O3362","v":0}]
[null,null,null,null,null,null,null,null,null,null,null,null,null,null,null,{"$f":"J3363+O3363","v":0}]
[null,null,null,null,null,null,null,null,null,null,null,null,null,null,null,{"$f":"J3364+O3364","v":0}]
[null,null,null,null,null,null,null,null,null,null,null,null,null,null,null,{"$f":"J3365+O3365","v":0}]
[null,null,null,null,null,null,null,null,null,null,null,null,null,null,null,{"$f":"J3366+O3366","v":0}]
[null,null,null,null,null,null,null,null,null,null,null,null,null,null,null,{"$f":"J3367+O3367","v":0}]
[null,null,null,null,null,null,null,null,null,null,null,null,null,null,null,{"$f":"J3368+O3368","v":0}]
[null,null,null,null,null,null,null,null,null,null,null,null,null,null,null,{"$f":"J3369+O3369","v":0}]
[null,null,null,null,null,null,null,null,null,null,null,null,null,null,null,{"$f":"J3370+O3370","v":0}]
[null,null,null,null,null,null,null,null,null,null,null,null,null,null,null,{"$f":"J3371+O3371","v":0}]
[null,null,null,null,null,null,null,null,null,null,null,null,null,null,null,{"$f":"J3372+O3372","v":0}]
[null,null,null,null,null,null,null,null,null,null,null,null,null,null,null,{"$f":"J3373+O3373","v":0}]
[null,null,null,null,null,null,null,null,null,null,null,null,null,null,null,{"$f":"J3374+O3374","v":0}]
[null,null,null,null,null,null,null,null,null,null,null,null,null,null,null,{"$f":"J3375+O3375","v":0}]
[null,null,null,null,null,null,null,null,null,null,null,null,null,null,null,{"$f":"J3376+O3376","v":0}]
[null,null,null,null,null,null,null,null,null,null,null,null,null,null,null,{"$f":"J3377+O3377","v":0}]
[null,null,null,null,null,null,null,null,null,null,null,null,null,null,null,{"$f":"J3378+O3378","v":0}]
[null,null,null,null,null,null,null,null,null,null,null,null,null,null,null,{"$f":"J3379+O3379","v":0}]
[null,null,null,null,null,null,null,null,null,null,null,null,null,null,null,{"$f":"J3380+O3380","v":0}]
[null,null,null,null,null,null,null,null,null,null,null,null,null,null,null,{"$f":"J3381+O3381","v":0}]
[null,null,null,null,null,null,null,null,null,null,null,null,null,null,null,{"$f":"J3382+O3382","v":0}]
[null,null,null,null,null,null,null,null,null,null,null,null,null,null,null,{"$f":"J3383+O3383","v":0}]
[null,null,null,null,null,null,null,null,null,null,null,null,null,null,null,{"$f":"J3384+O3384","v":0}]
[null,null,null,null,null,null,null,null,null,null,null,null,null,null,null,{"$f":"J3385+O3385","v":0}]
[null,null,null,null,null,null,null,null,null,null,null,null,null,null,null,{"$f":"J3386+O3386","v":0}]
[null,null,null,null,null,null,null,null,null,null,null,null,null,null,null,{"$f":"J3387+O3387","v":0}]
[null,null,null,null,null,null,null,null,null,null,null,null,null,null,null,{"$f":"J3388+O3388","v":0}]
[null,null,null,null,null,null,null,null,null,null,null,null,null,null,null,{"$f":"J3389+O3389","v":0}]
[null,null,null,null,null,null,null,null,null,null,null,null,null,null,null,{"$f":"J3390+O3390","v":0}]
[null,null,null,null,null,null,null,null,null,null,null,null,null,null,null,{"$f":"J3391+O3391","v":0}]
[null,null,null,null,null,null,null,null,null,null,null,null,null,null,null,{"$f":"J3392+O3392","v":0}]
[null,null,null,null,null,null,null,null,null,null,null,null,null,null,null,{"$f":"J3393+O3393","v":0}]
[null,null,null,null,null,null,null,null,null,null,null,null,null,null,null,{"$f":"J3394+O3394","v":0}]
[null,null,null,null,null,null,null,null,null,null,null,null,null,null,null,{"$f":"J3395+O3395","v":0}]
[null,null,null,null,null,null,null,null,null,null,null,null,null,null,null,{"$f":"J3396+O3396","v":0}]
[null,null,null,null,null,null,null,null,null,null,null,null,null,null,null,{"$f":"J3397+O3397","v":0}]
[null,null,null,null,null,null,null,null,null,null,null,null,null,null,null,{"$f":"J3398+O3398","v":0}]
[null,null,null,null,null,null,null,null,null,null,null,null,null,null,null,{"$f":"J3399+O3399","v":0}]
[null,null,null,null,null,null,null,null,null,null,null,null,null,null,null,{"$f":"J3400+O3400","v":0}]
[null,null,null,null,null,null,null,null,null,null,null,null,null,null,null,{"$f":"J3401+O3401","v":0}]
[null,null,null,null,null,null,null,null,null,null,null,null,null,null,null,{"$f":"J3402+O3402","v":0}]
[null,null,null,null,null,null,null,null,null,null,null,null,null,null,null,{"$f":"J3403+O3403","v":0}]
[null,null,null,null,null,null,null,null,null,null,null,null,null,null,null,{"$f":"J3404+O3404","v":0}]
[null,null,null,null,null,null,null,null,null,null,null,null,null,null,null,{"$f":"J3405+O3405","v":0}]
[null,null,null,null,null,null,null,null,null,null,null,null,null,null,null,{"$f":"J3406+O3406","v":0}]
[null,null,null,null,null,null,null,null,null,null,null,null,null,null,null,{"$f":"J3407+O3407","v":0}]
[null,null,null,null,null,null,null,null,null,null,null,null,null,null,null,{"$f":"J3408+O3408","v":0}]
[null,null,null,null,null,null,null,null,null,null,null,null,null,null,null,{"$f":"J3409+O3409","v":0}]
[null,null,null,null,null,null,null,null,null,null,null,null,null,null,null,{"$f":"J3410+O3410","v":0}]
[null,null,null,null,null,null,null,null,null,null,null,null,null,null,null,{"$f":"J3411+O3411","v":0}]
[null,null,null,null,null,null,null,null,null,null,null,null,null,null,null,{"$f":"J3412+O3412","v":0}]
[null,null,null,null,null,null,null,null,null,null,null,null,null,null,null,{"$f":"J3413+O3413","v":0}]
[null,null,null,null,null,null,null,null,null,null,null,null,null,null,null,{"$f":"J3414+O3414","v":0}]
[null,null,null,null,null,null,null,null,null,null,null,null,null,null,null,{"$f":"J3415+O3415","v":0}]
[null,null,null,null,null,null,null,null,null,null,null,null,null,null,null,{"$f":"J3416+O3416","v":0}]
[null,null,null,null,null,null,null,null,null,null,null,null,null,null,null,{"$f":"J3417+O3417","v":0}]
[null,null,null,null,null,null,null,null,null,null,null,null,null,null,null,{"$f":"J3418+O3418","v":0}]
[null,null,null,null,null,null,null,null,null,null,null,null,null,null,null,{"$f":"J3419+O3419","v":0}]
[null,null,null,null,null,null,null,null,null,null,null,null,null,null,null,{"$f":"J3420+O3420","v":0}]
[null,null,null,null,null,null,null,null,null,null,null,null,null,null,null,{"$f":"J3421+O3421","v":0}]
[null,null,null,null,null,null,null,null,null,null,null,null,null,null,null,{"$f":"J3422+O3422","v":0}]
[null,null,null,null,null,null,null,null,null,null,null,null,null,null,null,{"$f":"J3423+O3423","v":0}]
[null,null,null,null,null,null,null,null,null,null,null,null,null,null,null,{"$f":"J3424+O3424","v":0}]
[null,null,null,null,null,null,null,null,null,null,null,null,null,null,null,{"$f":"J3425+O3425","v":0}]
[null,null,null,null,null,null,null,null,null,null,null,null,null,null,null,{"$f":"J3426+O3426","v":0}]
[null,null,null,null,null,null,null,null,null,null,null,null,null,null,null,{"$f":"J3427+O3427","v":0}]
[null,null,null,null,null,null,null,null,null,null,null,null,null,null,null,{"$f":"J3428+O3428","v":0}]
[null,null,null,null,null,null,null,null,null,null,null,null,null,null,null,{"$f":"J3429+O3429","v":0}]
[null,null,null,null,null,null,null,null,null,null,null,null,null,null,null,{"$f":"J3430+O3430","v":0}]
[null,null,null,null,null,null,null,null,null,null,null,null,null,null,null,{"$f":"J3431+O3431","v":0}]
[null,null,null,null,null,null,null,null,null,null,null,null,null,null,null,{"$f":"J3432+O3432","v":0}]
[null,null,null,null,null,null,null,null,null,null,null,null,null,null,null,{"$f":"J3433+O3433","v":0}]
[null,null,null,null,null,null,null,null,null,null,null,null,null,null,null,{"$f":"J3434+O3434","v":0}]
[null,null,null,null,null,null,null,null,null,null,null,null,null,null,null,{"$f":"J3435+O3435","v":0}]
[null,null,null,null,null,null,null,null,null,null,null,null,null,null,null,{"$f":"J3436+O3436","v":0}]
[null,null,null,null,null,null,null,null,null,null,null,null,null,null,null,{"$f":"J3437+O3437","v":0}]
[null,null,null,null,null,null,null,null,null,null,null,null,null,null,null,{"$f":"J3438+O3438","v":0}]
[null,null,null,null,null,null,null,null,null,null,null,null,null,null,null,{"$f":"J3439+O3439","v":0}]
[null,null,null,null,null,null,null,null,null,null,null,null,null,null,null,{"$f":"J3440+O3440","v":0}]
[null,null,null,null,null,null,null,null,null,null,null,null,null,null,null,{"$f":"J3441+O3441","v":0}]
[null,null,null,null,null,null,null,null,null,null,null,null,null,null,null,{"$f":"J3442+O3442","v":0}]
[null,null,null,null,null,null,null,null,null,null,null,null,null,null,null,{"$f":"J3443+O3443","v":0}]
[null,null,null,null,null,null,null,null,null,null,null,null,null,null,null,{"$f":"J3444+O3444","v":0}]
[null,null,null,null,null,null,null,null,null,null,null,null,null,null,null,{"$f":"J3445+O3445","v":0}]
[null,null,null,null,null,null,null,null,null,null,null,null,null,null,null,{"$f":"J3446+O3446","v":0}]
[null,null,null,null,null,null,null,null,null,null,null,null,null,null,null,{"$f":"J3447+O3447","v":0}]
[null,null,null,null,null,null,null,null,null,null,null,null,null,null,null,{"$f":"J3448+O3448","v":0}]
[null,null,null,null,null,null,null,null,null,null,null,null,null,null,null,{"$f":"J3449+O3449","v":0}]
[null,null,null,null,null,null,null,null,null,null,null,null,null,null,null,{"$f":"J3450+O3450","v":0}]
[null,null,null,null,null,null,null,null,null,null,null,null,null,null,null,{"$f":"J3451+O3451","v":0}]
[null,null,null,null,null,null,null,null,null,null,null,null,null,null,null,{"$f":"J3452+O3452","v":0}]
[null,null,null,null,null,null,null,null,null,null,null,null,null,null,null,{"$f":"J3453+O3453","v":0}]
[null,null,null,null,null,null,null,null,null,null,null,null,null,null,null,{"$f":"J3454+O3454","v":0}]
[null,null,null,null,null,null,null,null,null,null,null,null,null,null,null,{"$f":"J3455+O3455","v":0}]
[null,null,null,null,null,null,null,null,null,null,null,null,null,null,null,{"$f":"J3456+O3456","v":0}]
[null,null,null,null,null,null,null,null,null,null,null,null,null,null,null,{"$f":"J3457+O3457","v":0}]
[null,null,null,null,null,null,null,null,null,null,null,null,null,null,null,{"$f":"J3458+O3458","v":0}]
[null,null,null,null,null,null,null,null,null,null,null,null,null,null,null,{"$f":"J3459+O3459","v":0}]
[null,null,null,null,null,null,null,null,null,null,null,null,null,null,null,{"$f":"J3460+O3460","v":0}]
[null,null,null,null,null,null,null,null,null,null,null,null,null,null,null,{"$f":"J3461+O3461","v":0}]
[null,null,null,null,null,null,null,null,null,null,null,null,null,null,null,{"$f":"J3462+O3462","v":0}]
[null,null,null,null,null,null,null,null,null,null,null,null,null,null,null,{"$f":"J3463+O3463","v":0}]
[null,null,null,null,null,null,null,null,null,null,null,null,null,null,null,{"$f":"J3464+O3464","v":0}]
[null,null,null,null,null,null,null,null,null,null,null,null,null,null,null,{"$f":"J3465+O3465","v":0}]
[null,null,null,null,null,null,null,null,null,null,null,null,null,null,null,{"$f":"J3466+O3466","v":0}]
[null,null,null,null,null,null,null,null,null,null,null,null,null,null,null,{"$f":"J3467+O3467","v":0}]
[null,null,null,null,null,null,null,null,null,null,null,null,null,null,null,{"$f":"J3468+O3468","v":0}]
[null,null,null,null,null,null,null,null,null,null,null,null,null,null,null,{"$f":"J3469+O3469","v":0}]
[null,null,null,null,null,null,null,null,null,null,null,null,null,null,null,{"$f":"J3470+O3470","v":0}]
[null,null,null,null,null,null,null,null,null,null,null,null,null,null,null,{"$f":"J3471+O3471","v":0}]
[null,null,null,null,null,null,null,null,null,null,null,null,null,null,null,{"$f":"J3472+O3472","v":0}]
[null,null,null,null,null,null,null,null,null,null,null,null,null,null,null,{"$f":"J3473+O3473","v":0}]
[null,null,null,null,null,null,null,null,null,null,null,null,null,null,null,{"$f":"J3474+O3474","v":0}]
[null,null,null,null,null,null,null,null,null,null,null,null,null,null,null,{"$f":"J3475+O3475","v":0}]
[null,null,null,null,null,null,null,null,null,null,null,null,null,null,null,{"$f":"J3476+O3476","v":0}]
[null,null,null,null,null,null,null,null,null,null,null,null,null,null,null,{"$f":"J3477+O3477","v":0}]
[null,null,null,null,null,null,null,null,null,null,null,null,null,null,null,{"$f":"J3478+O3478","v":0}]
[null,null,null,null,null,null,null,null,null,null,null,null,null,null,null,{"$f":"J3479+O3479","v":0}]
[null,null,null,null,null,null,null,null,null,null,null,null,null,null,null,{"$f":"J3480+O3480","v":0}]
[null,null,null,null,null,null,null,null,null,null,null,null,null,null,null,{"$f":"J3481+O3481","v":0}]
[null,null,null,null,null,null,null,null,null,null,null,null,null,null,null,{"$f":"J3482+O3482","v":0}]
[null,null,null,null,null,null,null,null,null,null,null,null,null,null,null,{"$f":"J3483+O3483","v":0}]
[null,null,null,null,null,null,null,null,null,null,null,null,null,null,null,{"$f":"J3484+O3484","v":0}]
[null,null,null,null,null,null,null,null,null,null,null,null,null,null,null,{"$f":"J3485+O3485","v":0}]
[null,null,null,null,null,null,null,null,null,null,null,null,null,null,null,{"$f":"J3486+O3486","v":0}]
[null,null,null,null,null,null,null,null,null,null,null,null,null,null,null,{"$f":"J3487+O3487","v":0}]
[null,null,null,null,null,null,null,null,null,null,null,null,null,null,null,{"$f":"J3488+O3488","v":0}]
[null,null,null,null,null,null,null,null,null,null,null,null,null,null,null,{"$f":"J3489+O3489","v":0}]
[null,null,null,null,null,null,null,null,null,null,null,null,null,null,null,{"$f":"J3490+O3490","v":0}]
[null,null,null,null,null,null,null,null,null,null,null,null,null,null,null,{"$f":"J3491+O3491","v":0}]
[null,null,null,null,null,null,null,null,null,null,null,null,null,null,null,{"$f":"J3492+O3492","v":0}]
[null,null,null,null,null,null,null,null,null,null,null,null,null,null,null,{"$f":"J3493+O3493","v":0}]
[null,null,null,null,null,null,null,null,null,null,null,null,null,null,null,{"$f":"J3494+O3494","v":0}]
[null,null,null,null,null,null,null,null,null,null,null,null,null,null,null,{"$f":"J3495+O3495","v":0}]
[null,null,null,null,null,null,null,null,null,null,null,null,null,null,null,{"$f":"J3496+O3496","v":0}]
[null,null,null,null,null,null,null,null,null,null,null,null,null,null,null,{"$f":"J3497+O3497","v":0}]
[null,null,null,null,null,null,null,null,null,null,null,null,null,null,null,{"$f":"J3498+O3498","v":0}]
[null,null,null,null,null,null,null,null,null,null,null,null,null,null,null,{"$f":"J3499+O3499","v":0}]
[null,null,null,null,null,null,null,null,null,null,null,null,null,null,null,{"$f":"J3500+O3500","v":0}]
[null,null,null,null,null,null,null,null,null,null,null,null,null,null,null,{"$f":"J3501+O3501","v":0}]
[null,null,null,null,null,null,null,null,null,null,null,null,null,null,null,{"$f":"J3502+O3502","v":0}]
[null,null,null,null,null,null,null,null,null,null,null,null,null,null,null,{"$f":"J3503+O3503","v":0}]
[null,null,null,null,null,null,null,null,null,null,null,null,null,null,null,{"$f":"J3504+O3504","v":0}]
[null,null,null,null,null,null,null,null,null,null,null,null,null,null,null,{"$f":"J3505+O3505","v":0}]
[null,null,null,null,null,null,null,null,null,null,null,null,null,null,null,{"$f":"J3506+O3506","v":0}]
[null,null,null,null,null,null,null,null,null,null,null,null,null,null,null,{"$f":"J3507+O3507","v":0}]
[null,null,null,null,null,null,null,null,null,null,null,null,null,null,null,{"$f":"J3508+O3508","v":0}]
[null,null,null,null,null,null,null,null,null,null,null,null,null,null,null,{"$f":"J3509+O3509","v":0}]
[null,null,null,null,null,null,null,null,null,null,null,null,null,null,null,{"$f":"J3510+O3510","v":0}]
[null,null,null,null,null,null,null,null,null,null,null,null,null,null,null,{"$f":"J3511+O3511","v":0}]
[null,null,null,null,null,null,null,null,null,null,null,null,null,null,null,{"$f":"J3512+O3512","v":0}]
[null,null,null,null,null,null,null,null,null,null,null,null,null,null,null,{"$f":"J3513+O3513","v":0}]
[null,null,null,null,null,null,null,null,null,null,null,null,null,null,null,{"$f":"J3514+O3514","v":0}]
[null,null,null,null,null,null,null,null,null,null,null,null,null,null,null,{"$f":"J3515+O3515","v":0}]
[null,null,null,null,null,null,null,null,null,null,null,null,null,null,null,{"$f":"J3516+O3516","v":0}]
[null,null,null,null,null,null,null,null,null,null,null,null,null,null,null,{"$f":"J3517+O3517","v":0}]
[null,null,null,null,null,null,null,null,null,null,null,null,null,null,null,{"$f":"J3518+O3518","v":0}]
[null,null,null,null,null,null,null,null,null,null,null,null,null,null,null,{"$f":"J3519+O3519","v":0}]
[null,null,null,null,null,null,null,null,null,null,null,null,null,null,null,{"$f":"J3520+O3520","v":0}]
[null,null,null,null,null,null,null,null,null,null,null,null,null,null,null,{"$f":"J3521+O3521","v":0}]
[null,null,null,null,null,null,null,null,null,null,null,null,null,null,null,{"$f":"J3522+O3522","v":0}]
[null,null,null,null,null,null,null,null,null,null,null,null,null,null,null,{"$f":"J3523+O3523","v":0}]
[null,null,null,null,null,null,null,null,null,null,null,null,null,null,null,{"$f":"J3524+O3524","v":0}]
[null,null,null,null,null,null,null,null,null,null,null,null,null,null,null,{"$f":"J3525+O3525","v":0}]
[null,null,null,null,null,null,null,null,null,null,null,null,null,null,null,{"$f":"J3526+O3526","v":0}]
[null,null,null,null,null,null,null,null,null,null,null,null,null,null,null,{"$f":"J3527+O3527","v":0}]
[null,null,null,null,null,null,null,null,null,null,null,null,null,null,null,{"$f":"J3528+O3528","v":0}]
[null,null,null,null,null,null,null,null,null,null,null,null,null,null,null,{"$f":"J3529+O3529","v":0}]
[null,null,null,null,null,null,null,null,null,null,null,null,null,null,null,{"$f":"J3530+O3530","v":0}]
[null,null,null,null,null,null,null,null,null,null,null,null,null,null,null,{"$f":"J3531+O3531","v":0}]
[null,null,null,null,null,null,null,null,null,null,null,null,null,null,null,{"$f":"J3532+O3532","v":0}]
[null,null,null,null,null,null,null,null,null,null,null,null,null,null,null,{"$f":"J3533+O3533","v":0}]
[null,null,null,null,null,null,null,null,null,null,null,null,null,null,null,{"$f":"J3534+O3534","v":0}]
[null,null,null,null,null,null,null,null,null,null,null,null,null,null,null,{"$f":"J3535+O3535","v":0}]
[null,null,null,null,null,null,null,null,null,null,null,null,null,null,null,{"$f":"J3536+O3536","v":0}]
[null,null,null,null,null,null,null,null,null,null,null,null,null,null,null,{"$f":"J3537+O3537","v":0}]
[null,null,null,null,null,null,null,null,null,null,null,null,null,null,null,{"$f":"J3538+O3538","v":0}]
[null,null,null,null,null,null,null,null,null,null,null,null,null,null,null,{"$f":"J3539+O3539","v":0}]
[null,null,null,null,null,null,null,null,null,null,null,null,null,null,null,{"$f":"J3540+O3540","v":0}]
[null,null,null,null,null,null,null,null,null,null,null,null,null,null,null,{"$f":"J3541+O3541","v":0}]
[null,null,null,null,null,null,null,null,null,null,null,null,null,null,null,{"$f":"J3542+O3542","v":0}]
[null,null,null,null,null,null,null,null,null,null,null,null,null,null,null,{"$f":"J3543+O3543","v":0}]
[null,null,null,null,null,null,null,null,null,null,null,null,null,null,null,{"$f":"J3544+O3544","v":0}]
[null,null,null,null,null,null,null,null,null,null,null,null,null,null,null,{"$f":"J3545+O3545","v":0}]
[null,null,null,null,null,null,null,null,null,null,null,null,null,null,null,{"$f":"J3546+O3546","v":0}]
[null,null,null,null,null,null,null,null,null,null,null,null,null,null,null,{"$f":"J3547+O3547","v":0}]
[null,null,null,null,null,null,null,null,null,null,null,null,null,null,null,{"$f":"J3548+O3548","v":0}]
[null,null,null,null,null,null,null,null,null,null,null,null,null,null,null,{"$f":"J3549+O3549","v":0}]
[null,null,null,null,null,null,null,null,null,null,null,null,null,null,null,{"$f":"J3550+O3550","v":0}]
[null,null,null,null,null,null,null,null,null,null,null,null,null,null,null,{"$f":"J3551+O3551","v":0}]
[null,null,null,null,null,null,null,null,null,null,null,null,null,null,null,{"$f":"J3552+O3552","v":0}]
[null,null,null,null,null,null,null,null,null,null,null,null,null,null,null,{"$f":"J3553+O3553","v":0}]
[null,null,null,null,null,null,null,null,null,null,null,null,null,null,null,{"$f":"J3554+O3554","v":0}]
[null,null,null,null,null,null,null,null,null,null,null,null,null,null,null,{"$f":"J3555+O3555","v":0}]
[null,null,null,null,null,null,null,null,null,null,null,null,null,null,null,{"$f":"J3556+O3556","v":0}]
[null,null,null,null,null,null,null,null,null,null,null,null,null,null,null,{"$f":"J3557+O3557","v":0}]
[null,null,null,null,null,null,null,null,null,null,null,null,null,null,null,{"$f":"J3558+O3558","v":0}]
[null,null,null,null,null,null,null,null,null,null,null,null,null,null,null,{"$f":"J3559+O3559","v":0}]
[null,null,null,null,null,null,null,null,null,null,null,null,null,null,null,{"$f":"J3560+O3560","v":0}]
[null,null,null,null,null,null,null,null,null,null,null,null,null,null,null,{"$f":"J3561+O3561","v":0}]
[null,null,null,null,null,null,null,null,null,null,null,null,null,null,null,{"$f":"J3562+O3562","v":0}]
[null,null,null,null,null,null,null,null,null,null,null,null,null,null,null,{"$f":"J3563+O3563","v":0}]
[null,null,null,null,null,null,null,null,null,null,null,null,null,null,null,{"$f":"J3564+O3564","v":0}]
[null,null,null,null,null,null,null,null,null,null,null,null,null,null,null,{"$f":"J3565+O3565","v":0}]
[null,null,null,null,null,null,null,null,null,null,null,null,null,null,null,{"$f":"J3566+O3566","v":0}]
[null,null,null,null,null,null,null,null,null,null,null,null,null,null,null,{"$f":"J3567+O3567","v":0}]
[null,null,null,null,null,null,null,null,null,null,null,null,null,null,null,{"$f":"J3568+O3568","v":0}]
[null,null,null,null,null,null,null,null,null,null,null,null,null,null,null,{"$f":"J3569+O3569","v":0}]
[null,null,null,null,null,null,null,null,null,null,null,null,null,null,null,{"$f":"J3570+O3570","v":0}]
[null,null,null,null,null,null,null,null,null,null,null,null,null,null,null,{"$f":"J3571+O3571","v":0}]
[null,null,null,null,null,null,null,null,null,null,null,null,null,null,null,{"$f":"J3572+O3572","v":0}]
[null,null,null,null,null,null,null,null,null,null,null,null,null,null,null,{"$f":"J3573+O3573","v":0}]
[null,null,null,null,null,null,null,null,null,null,null,null,null,null,null,{"$f":"J3574+O3574","v":0}]
[null,null,null,null,null,null,null,null,null,null,null,null,null,null,null,{"$f":"J3575+O3575","v":0}]
[null,null,null,null,null,null,null,null,null,null,null,null,null,null,null,{"$f":"J3576+O3576","v":0}]
[null,null,null,null,null,null,null,null,null,null,null,null,null,null,null,{"$f":"J3577+O3577","v":0}]
[null,null,null,null,null,null,null,null,null,null,null,null,null,null,null,{"$f":"J3578+O3578","v":0}]
[null,null,null,null,null,null,null,null,null,null,null,null,null,null,null,{"$f":"J3579+O3579","v":0}]
[null,null,null,null,null,null,null,null,null,null,null,null,null,null,null,{"$f":"J3580+O3580","v":0}]
[null,null,null,null,null,null,null,null,null,null,null,null,null,null,null,{"$f":"J3581+O3581","v":0}]
[null,null,null,null,null,null,null,null,null,null,null,null,null,null,null,{"$f":"J3582+O3582","v":0}]
[null,null,null,null,null,null,null,null,null,null,null,null,null,null,null,{"$f":"J3583+O3583","v":0}]
[null,null,null,null,null,null,null,null,null,null,null,null,null,null,null,{"$f":"J3584+O3584","v":0}]
[null,null,null,null,null,null,null,null,null,null,null,null,null,null,null,{"$f":"J3585+O3585","v":0}]
[null,null,null,null,null,null,null,null,null,null,null,null,null,null,null,{"$f":"J3586+O3586","v":0}]
[null,null,null,null,null,null,null,null,null,null,null,null,null,null,null,{"$f":"J3587+O3587","v":0}]
[null,null,null,null,null,null,null,null,null,null,null,null,null,null,null,{"$f":"J3588+O3588","v":0}]
[null,null,null,null,null,null,null,null,null,null,null,null,null,null,null,{"$f":"J3589+O3589","v":0}]
[null,null,null,null,null,null,null,null,null,null,null,null,null,null,null,{"$f":"J3590+O3590","v":0}]
[null,null,null,null,null,null,null,null,null,null,null,null,null,null,null,{"$f":"J3591+O3591","v":0}]
[null,null,null,null,null,null,null,null,null,null,null,null,null,null,null,{"$f":"J3592+O3592","v":0}]
[null,null,null,null,null,null,null,null,null,null,null,null,null,null,null,{"$f":"J3593+O3593","v":0}]
[null,null,null,null,null,null,null,null,null,null,null,null,null,null,null,{"$f":"J3594+O3594","v":0}]
[null,null,null,null,null,null,null,null,null,null,null,null,null,null,null,{"$f":"J3595+O3595","v":0}]
[null,null,null,null,null,null,null,null,null,null,null,null,null,null,null,{"$f":"J3596+O3596","v":0}]
[null,null,null,null,null,null,null,null,null,null,null,null,null,null,null,{"$f":"J3597+O3597","v":0}]
[null,null,null,null,null,null,null,null,null,null,null,null,null,null,null,{"$f":"J3598+O3598","v":0}]
[null,null,null,null,null,null,null,null,null,null,null,null,null,null,null,{"$f":"J3599+O3599","v":0}]
[null,null,null,null,null,null,null,null,null,null,null,null,null,null,null,{"$f":"J3600+O3600","v":0}]
[null,null,null,null,null,null,null,null,null,null,null,null,null,null,null,{"$f":"J3601+O3601","v":0}]
[null,null,null,null,null,null,null,null,null,null,null,null,null,null,null,{"$f":"J3602+O3602","v":0}]
[null,null,null,null,null,null,null,null,null,null,null,null,null,null,null,{"$f":"J3603+O3603","v":0}]
[null,null,null,null,null,null,null,null,null,null,null,null,null,null,null,{"$f":"J3604+O3604","v":0}]
[null,null,null,null,null,null,null,null,null,null,null,null,null,null,null,{"$f":"J3605+O3605","v":0}]
[null,null,null,null,null,null,null,null,null,null,null,null,null,null,null,{"$f":"J3606+O3606","v":0}]
[null,null,null,null,null,null,null,null,null,null,null,null,null,null,null,{"$f":"J3607+O3607","v":0}]
[null,null,null,null,null,null,null,null,null,null,null,null,null,null,null,{"$f":"J3608+O3608","v":0}]
[null,null,null,null,null,null,null,null,null,null,null,null,null,null,null,{"$f":"J3609+O3609","v":0}]
[null,null,null,null,null,null,null,null,null,null,null,null,null,null,null,{"$f":"J3610+O3610","v":0}]
[null,null,null,null,null,null,null,null,null,null,null,null,null,null,null,{"$f":"J3611+O3611","v":0}]
[null,null,null,null,null,null,null,null,null,null,null,null,null,null,null,{"$f":"J3612+O3612","v":0}]
[null,null,null,null,null,null,null,null,null,null,null,null,null,null,null,{"$f":"J3613+O3613","v":0}]
[null,null,null,null,null,null,null,null,null,null,null,null,null,null,null,{"$f":"J3614+O3614","v":0}]
[null,null,null,null,null,null,null,null,null,null,null,null,null,null,null,{"$f":"J3615+O3615","v":0}]
[null,null,null,null,null,null,null,null,null,null,null,null,null,null,null,{"$f":"J3616+O3616","v":0}]
[null,null,null,null,null,null,null,null,null,null,null,null,null,null,null,{"$f":"J3617+O3617","v":0}]
[null,null,null,null,null,null,null,null,null,null,null,null,null,null,null,{"$f":"J3618+O3618","v":0}]
[null,null,null,null,null,null,null,null,null,null,null,null,null,null,null,{"$f":"J3619+O3619","v":0}]
[null,null,null,null,null,null,null,null,null,null,null,null,null,null,null,{"$f":"J3620+O3620","v":0}]
[null,null,null,null,null,null,null,null,null,null,null,null,null,null,null,{"$f":"J3621+O3621","v":0}]
[null,null,null,null,null,null,null,null,null,null,null,null,null,null,null,{"$f":"J3622+O3622","v":0}]
[null,null,null,null,null,null,null,null,null,null,null,null,null,null,null,{"$f":"J3623+O3623","v":0}]
[null,null,null,null,null,null,null,null,null,null,null,null,null,null,null,{"$f":"J3624+O3624","v":0}]
[null,null,null,null,null,null,null,null,null,null,null,null,null,null,null,{"$f":"J3625+O3625","v":0}]
[null,null,null,null,null,null,null,null,null,null,null,null,null,null,null,{"$f":"J3626+O3626","v":0}]
[null,null,null,null,null,null,null,null,null,null,null,null,null,null,null,{"$f":"J3627+O3627","v":0}]
[null,null,null,null,null,null,null,null,null,null,null,null,null,null,null,{"$f":"J3628+O3628","v":0}]
[null,null,null,null,null,null,null,null,null,null,null,null,null,null,null,{"$f":"J3629+O3629","v":0}]
[null,null,null,null,null,null,null,null,null,null,null,null,null,null,null,{"$f":"J3630+O3630","v":0}]
[null,null,null,null,null,null,null,null,null,null,null,null,null,null,null,{"$f":"J3631+O3631","v":0}]
[null,null,null,null,null,null,null,null,null,null,null,null,null,null,null,{"$f":"J3632+O3632","v":0}]
[null,null,null,null,null,null,null,null,null,null,null,null,null,null,null,{"$f":"J3633+O3633","v":0}]
[null,null,null,null,null,null,null,null,null,null,null,null,null,null,null,{"$f":"J3634+O3634","v":0}]
[null,null,null,null,null,null,null,null,null,null,null,null,null,null,null,{"$f":"J3635+O3635","v":0}]
[null,null,null,null,null,null,null,null,null,null,null,null,null,null,null,{"$f":"J3636+O3636","v":0}]
[null,null,null,null,null,null,null,null,null,null,null,null,null,null,null,{"$f":"J3637+O3637","v":0}]
[null,null,null,null,null,null,null,null,null,null,null,null,null,null,null,{"$f":"J3638+O3638","v":0}]
[null,null,null,null,null,null,null,null,null,null,null,null,null,null,null,{"$f":"J3639+O3639","v":0}]
[null,null,null,null,null,null,null,null,null,null,null,null,null,null,null,{"$f":"J3640+O3640","v":0}]
[null,null,null,null,null,null,null,null,null,null,null,null,null,null,null,{"$f":"J3641+O3641","v":0}]
[null,null,null,null,null,null,null,null,null,null,null,null,null,null,null,{"$f":"J3642+O3642","v":0}]
[null,null,null,null,null,null,null,null,null,null,null,null,null,null,null,{"$f":"J3643+O3643","v":0}]
[null,null,null,null,null,null,null,null,null,null,null,null,null,null,null,{"$f":"J3644+O3644","v":0}]
[null,null,null,null,null,null,null,null,null,null,null,null,null,null,null,{"$f":"J3645+O3645","v":0}]
[null,null,null,null,null,null,null,null,null,null,null,null,null,null,null,{"$f":"J3646+O3646","v":0}]
[null,null,null,null,null,null,null,null,null,null,null,null,null,null,null,{"$f":"J3647+O3647","v":0}]
[null,null,null,null,null,null,null,null,null,null,null,null,null,null,null,{"$f":"J3648+O3648","v":0}]
[null,null,null,null,null,null,null,null,null,null,null,null,null,null,null,{"$f":"J3649+O3649","v":0}]
[null,null,null,null,null,null,null,null,null,null,null,null,null,null,null,{"$f":"J3650+O3650","v":0}]
[null,null,null,null,null,null,null,null,null,null,null,null,null,null,null,{"$f":"J3651+O3651","v":0}]
[null,null,null,null,null,null,null,null,null,null,null,null,null,null,null,{"$f":"J3652+O3652","v":0}]
[null,null,null,null,null,null,null,null,null,null,null,null,null,null,null,{"$f":"J3653+O3653","v":0}]
[null,null,null,null,null,null,null,null,null,null,null,null,null,null,null,{"$f":"J3654+O3654","v":0}]
[null,null,null,null,null,null,null,null,null,null,null,null,null,null,null,{"$f":"J3655+O3655","v":0}]
[null,null,null,null,null,null,null,null,null,null,null,null,null,null,null,{"$f":"J3656+O3656","v":0}]
[null,null,null,null,null,null,null,null,null,null,null,null,null,null,null,{"$f":"J3657+O3657","v":0}]
[null,null,null,null,null,null,null,null,null,null,null,null,null,null,null,{"$f":"J3658+O3658","v":0}]
[null,null,null,null,null,null,null,null,null,null,null,null,null,null,null,{"$f":"J3659+O3659","v":0}]
[null,null,null,null,null,null,null,null,null,null,null,null,null,null,null,{"$f":"J3660+O3660","v":0}]
[null,null,null,null,null,null,null,null,null,null,null,null,null,null,null,{"$f":"J3661+O3661","v":0}]
[null,null,null,null,null,null,null,null,null,null,null,null,null,null,null,{"$f":"J3662+O3662","v":0}]
[null,null,null,null,null,null,null,null,null,null,null,null,null,null,null,{"$f":"J3663+O3663","v":0}]
[null,null,null,null,null,null,null,null,null,null,null,null,null,null,null,{"$f":"J3664+O3664","v":0}]
[null,null,null,null,null,null,null,null,null,null,null,null,null,null,null,{"$f":"J3665+O3665","v":0}]
[null,null,null,null,null,null,null,null,null,null,null,null,null,null,null,{"$f":"J3666+O3666","v":0}]
[null,null,null,null,null,null,null,null,null,null,null,null,null,null,null,{"$f":"J3667+O3667","v":0}]
[null,null,null,null,null,null,null,null,null,null,null,null,null,null,null,{"$f":"J3668+O3668","v":0}]
[null,null,null,null,null,null,null,null,null,null,null,null,null,null,null,{"$f":"J3669+O3669","v":0}]
[null,null,null,null,null,null,null,null,null,null,null,null,null,null,null,{"$f":"J3670+O3670","v":0}]
[null,null,null,null,null,null,null,null,null,null,null,null,null,null,null,{"$f":"J3671+O3671","v":0}]
[null,null,null,null,null,null,null,null,null,null,null,null,null,null,null,{"$f":"J3672+O3672","v":0}]
[null,null,null,null,null,null,null,null,null,null,null,null,null,null,null,{"$f":"J3673+O3673","v":0}]
[null,null,null,null,null,null,null,null,null,null,null,null,null,null,null,{"$f":"J3674+O3674","v":0}]
[null,null,null,null,null,null,null,null,null,null,null,null,null,null,null,{"$f":"J3675+O3675","v":0}]
[null,null,null,null,null,null,null,null,null,null,null,null,null,null,null,{"$f":"J3676+O3676","v":0}]
[null,null,null,null,null,null,null,null,null,null,null,null,null,null,null,{"$f":"J3677+O3677","v":0}]
[null,null,null,null,null,null,null,null,null,null,null,null,null,null,null,{"$f":"J3678+O3678","v":0}]
[null,null,null,null,null,null,null,null,null,null,null,null,null,null,null,{"$f":"J3679+O3679","v":0}]
[null,null,null,null,null,null,null,null,null,null,null,null,null,null,null,{"$f":"J3680+O3680","v":0}]
[null,null,null,null,null,null,null,null,null,null,null,null,null,null,null,{"$f":"J3681+O3681","v":0}]
[null,null,null,null,null,null,null,null,null,null,null,null,null,null,null,{"$f":"J3682+O3682","v":0}]
[null,null,null,null,null,null,null,null,null,null,null,null,null,null,null,{"$f":"J3683+O3683","v":0}]
[null,null,null,null,null,null,null,null,null,null,null,null,null,null,null,{"$f":"J3684+O3684","v":0}]
[null,null,null,null,null,null,null,null,null,null,null,null,null,null,null,{"$f":"J3685+O3685","v":0}]
[null,null,null,null,null,null,null,null,null,null,null,null,null,null,null,{"$f":"J3686+O3686","v":0}]
[null,null,null,null,null,null,null,null,null,null,null,null,null,null,null,{"$f":"J3687+O3687","v":0}]
[null,null,null,null,null,null,null,null,null,null,null,null,null,null,null,{"$f":"J3688+O3688","v":0}]
[null,null,null,null,null,null,null,null,null,null,null,null,null,null,null,{"$f":"J3689+O3689","v":0}]
[null,null,null,null,null,null,null,null,null,null,null,null,null,null,null,{"$f":"J3690+O3690","v":0}]
[null,null,null,null,null,null,null,null,null,null,null,null,null,null,null,{"$f":"J3691+O3691","v":0}]
[null,null,null,null,null,null,null,null,null,null,null,null,null,null,null,{"$f":"J3692+O3692","v":0}]
[null,null,null,null,null,null,null,null,null,null,null,null,null,null,null,{"$f":"J3693+O3693","v":0}]
[null,null,null,null,null,null,null,null,null,null,null,null,null,null,null,{"$f":"J3694+O3694","v":0}]
[null,null,null,null,null,null,null,null,null,null,null,null,null,null,null,{"$f":"J3695+O3695","v":0}]
[null,null,null,null,null,null,null,null,null,null,null,null,null,null,null,{"$f":"J3696+O3696","v":0}]
[null,null,null,null,null,null,null,null,null,null,null,null,null,null,null,{"$f":"J3697+O3697","v":0}]
[null,null,null,null,null,null,null,null,null,null,null,null,null,null,null,{"$f":"J3698+O3698","v":0}]
[null,null,null,null,null,null,null,null,null,null,null,null,null,null,null,{"$f":"J3699+O3699","v":0}]
[null,null,null,null,null,null,null,null,null,null,null,null,null,null,null,{"$f":"J3700+O3700","v":0}]
[null,null,null,null,null,null,null,null,null,null,null,null,null,null,null,{"$f":"J3701+O3701","v":0}]
[null,null,null,null,null,null,null,null,null,null,null,null,null,null,null,{"$f":"J3702+O3702","v":0}]
[null,null,null,null,null,null,null,null,null,null,null,null,null,null,null,{"$f":"J3703+O3703","v":0}]
[null,null,null,null,null,null,null,null,null,null,null,null,null,null,null,{"$f":"J3704+O3704","v":0}]
[null,null,null,null,null,null,null,null,null,null,null,null,null,null,null,{"$f":"J3705+O3705","v":0}]
[null,null,null,null,null,null,null,null,null,null,null,null,null,null,null,{"$f":"J3706+O3706","v":0}]
[null,null,null,null,null,null,null,null,null,null,null,null,null,null,null,{"$f":"J3707+O3707","v":0}]
[null,null,null,null,null,null,null,null,null,null,null,null,null,null,null,{"$f":"J3708+O3708","v":0}]
[null,null,null,null,null,null,null,null,null,null,null,null,null,null,null,{"$f":"J3709+O3709","v":0}]
[null,null,null,null,null,null,null,null,null,null,null,null,null,null,null,{"$f":"J3710+O3710","v":0}]
[null,null,null,null,null,null,null,null,null,null,null,null,null,null,null,{"$f":"J3711+O3711","v":0}]
[null,null,null,null,null,null,null,null,null,null,null,null,null,null,null,{"$f":"J3712+O3712","v":0}]
[null,null,null,null,null,null,null,null,null,null,null,null,null,null,null,{"$f":"J3713+O3713","v":0}]
[null,null,null,null,null,null,null,null,null,null,null,null,null,null,null,{"$f":"J3714+O3714","v":0}]
[null,null,null,null,null,null,null,null,null,null,null,null,null,null,null,{"$f":"J3715+O3715","v":0}]
[null,null,null,null,null,null,null,null,null,null,null,null,null,null,null,{"$f":"J3716+O3716","v":0}]
[null,null,null,null,null,null,null,null,null,null,null,null,null,null,null,{"$f":"J3717+O3717","v":0}]
[null,null,null,null,null,null,null,null,null,null,null,null,null,null,null,{"$f":"J3718+O3718","v":0}]
[null,null,null,null,null,null,null,null,null,null,null,null,null,null,null,{"$f":"J3719+O3719","v":0}]
[null,null,null,null,null,null,null,null,null,null,null,null,null,null,null,{"$f":"J3720+O3720","v":0}]
[null,null,null,null,null,null,null,null,null,null,null,null,null,null,null,{"$f":"J3721+O3721","v":0}]
[null,null,null,null,null,null,null,null,null,null,null,null,null,null,null,{"$f":"J3722+O3722","v":0}]
[null,null,null,null,null,null,null,null,null,null,null,null,null,null,null,{"$f":"J3723+O3723","v":0}]
[null,null,null,null,null,null,null,null,null,null,null,null,null,null,null,{"$f":"J3724+O3724","v":0}]
[null,null,null,null,null,null,null,null,null,null,null,null,null,null,null,{"$f":"J3725+O3725","v":0}]
[null,null,null,null,null,null,null,null,null,null,null,null,null,null,null,{"$f":"J3726+O3726","v":0}]
[null,null,null,null,null,null,null,null,null,null,null,null,null,null,null,{"$f":"J3727+O3727","v":0}]
[null,null,null,null,null,null,null,null,null,null,null,null,null,null,null,{"$f":"J3728+O3728","v":0}]
[null,null,null,null,null,null,null,null,null,null,null,null,null,null,null,{"$f":"J3729+O3729","v":0}]
[null,null,null,null,null,null,null,null,null,null,null,null,null,null,null,{"$f":"J3730+O3730","v":0}]
[null,null,null,null,null,null,null,null,null,null,null,null,null,null,null,{"$f":"J3731+O3731","v":0}]
[null,null,null,null,null,null,null,null,null,null,null,null,null,null,null,{"$f":"J3732+O3732","v":0}]
[null,null,null,null,null,null,null,null,null,null,null,null,null,null,null,{"$f":"J3733+O3733","v":0}]
[null,null,null,null,null,null,null,null,null,null,null,null,null,null,null,{"$f":"J3734+O3734","v":0}]
[null,null,null,null,null,null,null,null,null,null,null,null,null,null,null,{"$f":"J3735+O3735","v":0}]
[null,null,null,null,null,null,null,null,null,null,null,null,null,null,null,{"$f":"J3736+O3736","v":0}]
[null,null,null,null,null,null,null,null,null,null,null,null,null,null,null,{"$f":"J3737+O3737","v":0}]
[null,null,null,null,null,null,null,null,null,null,null,null,null,null,null,{"$f":"J3738+O3738","v":0}]
[null,null,null,null,null,null,null,null,null,null,null,null,null,null,null,{"$f":"J3739+O3739","v":0}]
[null,null,null,null,null,null,null,null,null,null,null,null,null,null,null,{"$f":"J3740+O3740","v":0}]
[null,null,null,null,null,null,null,null,null,null,null,null,null,null,null,{"$f":"J3741+O3741","v":0}]
[null,null,null,null,null,null,null,null,null,null,null,null,null,null,null,{"$f":"J3742+O3742","v":0}]
[null,null,null,null,null,null,null,null,null,null,null,null,null,null,null,{"$f":"J3743+O3743","v":0}]
[null,null,null,null,null,null,null,null,null,null,null,null,null,null,null,{"$f":"J3744+O3744","v":0}]
[null,null,null,null,null,null,null,null,null,null,null,null,null,null,null,{"$f":"J3745+O3745","v":0}]
[null,null,null,null,null,null,null,null,null,null,null,null,null,null,null,{"$f":"J3746+O3746","v":0}]
[null,null,null,null,null,null,null,null,null,null,null,null,null,null,null,{"$f":"J3747+O3747","v":0}]
[null,null,null,null,null,null,null,null,null,null,null,null,null,null,null,{"$f":"J3748+O3748","v":0}]
[null,null,null,null,null,null,null,null,null,null,null,null,null,null,null,{"$f":"J3749+O3749","v":0}]
[null,null,null,null,null,null,null,null,null,null,null,null,null,null,null,{"$f":"J3750+O3750","v":0}]
[null,null,null,null,null,null,null,null,null,null,null,null,null,null,null,{"$f":"J3751+O3751","v":0}]
[null,null,null,null,null,null,null,null,null,null,null,null,null,null,null,{"$f":"J3752+O3752","v":0}]
[null,null,null,null,null,null,null,null,null,null,null,null,null,null,null,{"$f":"J3753+O3753","v":0}]
[null,null,null,null,null,null,null,null,null,null,null,null,null,null,null,{"$f":"J3754+O3754","v":0}]
[null,null,null,null,null,null,null,null,null,null,null,null,null,null,null,{"$f":"J3755+O3755","v":0}]
[null,null,null,null,null,null,null,null,null,null,null,null,null,null,null,{"$f":"J3756+O3756","v":0}]
[null,null,null,null,null,null,null,null,null,null,null,null,null,null,null,{"$f":"J3757+O3757","v":0}]
[null,null,null,null,null,null,null,null,null,null,null,null,null,null,null,{"$f":"J3758+O3758","v":0}]
[null,null,null,null,null,null,null,null,null,null,null,null,null,null,null,{"$f":"J3759+O3759","v":0}]
[null,null,null,null,null,null,null,null,null,null,null,null,null,null,null,{"$f":"J3760+O3760","v":0}]
[null,null,null,null,null,null,null,null,null,null,null,null,null,null,null,{"$f":"J3761+O3761","v":0}]
[null,null,null,null,null,null,null,null,null,null,null,null,null,null,null,{"$f":"J3762+O3762","v":0}]
[null,null,null,null,null,null,null,null,null,null,null,null,null,null,null,{"$f":"J3763+O3763","v":0}]
[null,null,null,null,null,null,null,null,null,null,null,null,null,null,null,{"$f":"J3764+O3764","v":0}]
[null,null,null,null,null,null,null,null,null,null,null,null,null,null,null,{"$f":"J3765+O3765","v":0}]
[null,null,null,null,null,null,null,null,null,null,null,null,null,null,null,{"$f":"J3766+O3766","v":0}]
[null,null,null,null,null,null,null,null,null,null,null,null,null,null,null,{"$f":"J3767+O3767","v":0}]
[null,null,null,null,null,null,null,null,null,null,null,null,null,null,null,{"$f":"J3768+O3768","v":0}]
[null,null,null,null,null,null,null,null,null,null,null,null,null,null,null,{"$f":"J3769+O3769","v":0}]
[null,null,null,null,null,null,null,null,null,null,null,null,null,null,null,{"$f":"J3770+O3770","v":0}]
[null,null,null,null,null,null,null,null,null,null,null,null,null,null,null,{"$f":"J3771+O3771","v":0}]
[null,null,null,null,null,null,null,null,null,null,null,null,null,null,null,{"$f":"J3772+O3772","v":0}]
[null,null,null,null,null,null,null,null,null,null,null,null,null,null,null,{"$f":"J3773+O3773","v":0}]
[null,null,null,null,null,null,null,null,null,null,null,null,null,null,null,{"$f":"J3774+O3774","v":0}]
[null,null,null,null,null,null,null,null,null,null,null,null,null,null,null,{"$f":"J3775+O3775","v":0}]
[null,null,null,null,null,null,null,null,null,null,null,null,null,null,null,{"$f":"J3776+O3776","v":0}]
[null,null,null,null,null,null,null,null,null,null,null,null,null,null,null,{"$f":"J3777+O3777","v":0}]
[null,null,null,null,null,null,null,null,null,null,null,null,null,null,null,{"$f":"J3778+O3778","v":0}]
[null,null,null,null,null,null,null,null,null,null,null,null,null,null,null,{"$f":"J3779+O3779","v":0}]
[null,null,null,null,null,null,null,null,null,null,null,null,null,null,null,{"$f":"J3780+O3780","v":0}]
[null,null,null,null,null,null,null,null,null,null,null,null,null,null,null,{"$f":"J3781+O3781","v":0}]
[null,null,null,null,null,null,null,null,null,null,null,null,null,null,null,{"$f":"J3782+O3782","v":0}]
[null,null,null,null,null,null,null,null,null,null,null,null,null,null,null,{"$f":"J3783+O3783","v":0}]
[null,null,null,null,null,null,null,null,null,null,null,null,null,null,null,{"$f":"J3784+O3784","v":0}]
[null,null,null,null,null,null,null,null,null,null,null,null,null,null,null,{"$f":"J3785+O3785","v":0}]
[null,null,null,null,null,null,null,null,null,null,null,null,null,null,null,{"$f":"J3786+O3786","v":0}]
[null,null,null,null,null,null,null,null,null,null,null,null,null,null,null,{"$f":"J3787+O3787","v":0}]
[null,null,null,null,null,null,null,null,null,null,null,null,null,null,null,{"$f":"J3788+O3788","v":0}]
[null,null,null,null,null,null,null,null,null,null,null,null,null,null,null,{"$f":"J3789+O3789","v":0}]
[null,null,null,null,null,null,null,null,null,null,null,null,null,null,null,{"$f":"J3790+O3790","v":0}]
[null,null,null,null,null,null,null,null,null,null,null,null,null,null,null,{"$f":"J3791+O3791","v":0}]
[null,null,null,null,null,null,null,null,null,null,null,null,null,null,null,{"$f":"J3792+O3792","v":0}]
[null,null,null,null,null,null,null,null,null,null,null,null,null,null,null,{"$f":"J3793+O3793","v":0}]
[null,null,null,null,null,null,null,null,null,null,null,null,null,null,null,{"$f":"J3794+O3794","v":0}]
[null,null,null,null,null,null,null,null,null,null,null,null,null,null,null,{"$f":"J3795+O3795","v":0}]
[null,null,null,null,null,null,null,null,null,null,null,null,null,null,null,{"$f":"J3796+O3796","v":0}]
[null,null,null,null,null,null,null,null,null,null,null,null,null,null,null,{"$f":"J3797+O3797","v":0}]
[null,null,null,null,null,null,null,null,null,null,null,null,null,null,null,{"$f":"J3798+O3798","v":0}]
[null,null,null,null,null,null,null,null,null,null,null,null,null,null,null,{"$f":"J3799+O3799","v":0}]
[null,null,null,null,null,null,null,null,null,null,null,null,null,null,null,{"$f":"J3800+O3800","v":0}]
[null,null,null,null,null,null,null,null,null,null,null,null,null,null,null,{"$f":"J3801+O3801","v":0}]
[null,null,null,null,null,null,null,null,null,null,null,null,null,null,null,{"$f":"J3802+O3802","v":0}]
[null,null,null,null,null,null,null,null,null,null,null,null,null,null,null,{"$f":"J3803+O3803","v":0}]
[null,null,null,null,null,null,null,null,null,null,null,null,null,null,null,{"$f":"J3804+O3804","v":0}]
[null,null,null,null,null,null,null,null,null,null,null,null,null,null,null,{"$f":"J3805+O3805","v":0}]
[null,null,null,null,null,null,null,null,null,null,null,null,null,null,null,{"$f":"J3806+O3806","v":0}]
[null,null,null,null,null,null,null,null,null,null,null,null,null,null,null,{"$f":"J3807+O3807","v":0}]
[null,null,null,null,null,null,null,null,null,null,null,null,null,null,null,{"$f":"J3808+O3808","v":0}]
[null,null,null,null,null,null,null,null,null,null,null,null,null,null,null,{"$f":"J3809+O3809","v":0}]
[null,null,null,null,null,null,null,null,null,null,null,null,null,null,null,{"$f":"J3810+O3810","v":0}]
[null,null,null,null,null,null,null,null,null,null,null,null,null,null,null,{"$f":"J3811+O3811","v":0}]
[null,null,null,null,null,null,null,null,null,null,null,null,null,null,null,{"$f":"J3812+O3812","v":0}]
[null,null,null,null,null,null,null,null,null,null,null,null,null,null,null,{"$f":"J3813+O3813","v":0}]
[null,null,null,null,null,null,null,null,null,null,null,null,null,null,null,{"$f":"J3814+O3814","v":0}]
[null,null,null,null,null,null,null,null,null,null,null,null,null,null,null,{"$f":"J3815+O3815","v":0}]
[null,null,null,null,null,null,null,null,null,null,null,null,null,null,null,{"$f":"J3816+O3816","v":0}]
[null,null,null,null,null,null,null,null,null,null,null,null,null,null,null,{"$f":"J3817+O3817","v":0}]
[null,null,null,null,null,null,null,null,null,null,null,null,null,null,null,{"$f":"J3818+O3818","v":0}]
[null,null,null,null,null,null,null,null,null,null,null,null,null,null,null,{"$f":"J3819+O3819","v":0}]
[null,null,null,null,null,null,null,null,null,null,null,null,null,null,null,{"$f":"J3820+O3820","v":0}]
[null,null,null,null,null,null,null,null,null,null,null,null,null,null,null,{"$f":"J3821+O3821","v":0}]
[null,null,null,null,null,null,null,null,null,null,null,null,null,null,null,{"$f":"J3822+O3822","v":0}]
[null,null,null,null,null,null,null,null,null,null,null,null,null,null,null,{"$f":"J3823+O3823","v":0}]
[null,null,null,null,null,null,null,null,null,null,null,null,null,null,null,{"$f":"J3824+O3824","v":0}]
[null,null,null,null,null,null,null,null,null,null,null,null,null,null,null,{"$f":"J3825+O3825","v":0}]
[null,null,null,null,null,null,null,null,null,null,null,null,null,null,null,{"$f":"J3826+O3826","v":0}]
[null,null,null,null,null,null,null,null,null,null,null,null,null,null,null,{"$f":"J3827+O3827","v":0}]
[null,null,null,null,null,null,null,null,null,null,null,null,null,null,null,{"$f":"J3828+O3828","v":0}]
[null,null,null,null,null,null,null,null,null,null,null,null,null,null,null,{"$f":"J3829+O3829","v":0}]
[null,null,null,null,null,null,null,null,null,null,null,null,null,null,null,{"$f":"J3830+O3830","v":0}]
[null,null,null,null,null,null,null,null,null,null,null,null,null,null,null,{"$f":"J3831+O3831","v":0}]
[null,null,null,null,null,null,null,null,null,null,null,null,null,null,null,{"$f":"J3832+O3832","v":0}]
[null,null,null,null,null,null,null,null,null,null,null,null,null,null,null,{"$f":"J3833+O3833","v":0}]
[null,null,null,null,null,null,null,null,null,null,null,null,null,null,null,{"$f":"J3834+O3834","v":0}]
[null,null,null,null,null,null,null,null,null,null,null,null,null,null,null,{"$f":"J3835+O3835","v":0}]
[null,null,null,null,null,null,null,null,null,null,null,null,null,null,null,{"$f":"J3836+O3836","v":0}]
[null,null,null,null,null,null,null,null,null,null,null,null,null,null,null,{"$f":"J3837+O3837","v":0}]
[null,null,null,null,null,null,null,null,null,null,null,null,null,null,null,{"$f":"J3838+O3838","v":0}]
[null,null,null,null,null,null,null,null,null,null,null,null,null,null,null,{"$f":"J3839+O3839","v":0}]
[null,null,null,null,null,null,null,null,null,null,null,null,null,null,null,{"$f":"J3840+O3840","v":0}]
[null,null,null,null,null,null,null,null,null,null,null,null,null,null,null,{"$f":"J3841+O3841","v":0}]
[null,null,null,null,null,null,null,null,null,null,null,null,null,null,null,{"$f":"J3842+O3842","v":0}]
[null,null,null,null,null,null,null,null,null,null,null,null,null,null,null,{"$f":"J3843+O3843","v":0}]
[null,null,null,null,null,null,null,null,null,null,null,null,null,null,null,{"$f":"J3844+O3844","v":0}]
[null,null,null,null,null,null,null,null,null,null,null,null,null,null,null,{"$f":"J3845+O3845","v":0}]
[null,null,null,null,null,null,null,null,null,null,null,null,null,null,null,{"$f":"J3846+O3846","v":0}]
[null,null,null,null,null,null,null,null,null,null,null,null,null,null,null,{"$f":"J3847+O3847","v":0}]
[null,null,null,null,null,null,null,null,null,null,null,null,null,null,null,{"$f":"J3848+O3848","v":0}]
[null,null,null,null,null,null,null,null,null,null,null,null,null,null,null,{"$f":"J3849+O3849","v":0}]
[null,null,null,null,null,null,null,null,null,null,null,null,null,null,null,{"$f":"J3850+O3850","v":0}]
[null,null,null,null,null,null,null,null,null,null,null,null,null,null,null,{"$f":"J3851+O3851","v":0}]
[null,null,null,null,null,null,null,null,null,null,null,null,null,null,null,{"$f":"J3852+O3852","v":0}]
[null,null,null,null,null,null,null,null,null,null,null,null,null,null,null,{"$f":"J3853+O3853","v":0}]
[null,null,null,null,null,null,null,null,null,null,null,null,null,null,null,{"$f":"J3854+O3854","v":0}]
[null,null,null,null,null,null,null,null,null,null,null,null,null,null,null,{"$f":"J3855+O3855","v":0}]
[null,null,null,null,null,null,null,null,null,null,null,null,null,null,null,{"$f":"J3856+O3856","v":0}]
[null,null,null,null,null,null,null,null,null,null,null,null,null,null,null,{"$f":"J3857+O3857","v":0}]
[null,null,null,null,null,null,null,null,null,null,null,null,null,null,null,{"$f":"J3858+O3858","v":0}]
[null,null,null,null,null,null,null,null,null,null,null,null,null,null,null,{"$f":"J3859+O3859","v":0}]
[null,null,null,null,null,null,null,null,null,null,null,null,null,null,null,{"$f":"J3860+O3860","v":0}]
[null,null,null,null,null,null,null,null,null,null,null,null,null,null,null,{"$f":"J3861+O3861","v":0}]
[null,null,null,null,null,null,null,null,null,null,null,null,null,null,null,{"$f":"J3862+O3862","v":0}]
[null,null,null,null,null,null,null,null,null,null,null,null,null,null,null,{"$f":"J3863+O3863","v":0}]
[null,null,null,null,null,null,null,null,null,null,null,null,null,null,null,{"$f":"J3864+O3864","v":0}]
[null,null,null,null,null,null,null,null,null,null,null,null,null,null,null,{"$f":"J3865+O3865","v":0}]
[null,null,null,null,null,null,null,null,null,null,null,null,null,null,null,{"$f":"J3866+O3866","v":0}]
[null,null,null,null,null,null,null,null,null,null,null,null,null,null,null,{"$f":"J3867+O3867","v":0}]
[null,null,null,null,null,null,null,null,null,null,null,null,null,null,null,{"$f":"J3868+O3868","v":0}]
[null,null,null,null,null,null,null,null,null,null,null,null,null,null,null,{"$f":"J3869+O3869","v":0}]
[null,null,null,null,null,null,null,null,null,null,null,null,null,null,null,{"$f":"J3870+O3870","v":0}]
[null,null,null,null,null,null,null,null,null,null,null,null,null,null,null,{"$f":"J3871+O3871","v":0}]
[null,null,null,null,null,null,null,null,null,null,null,null,null,null,null,{"$f":"J3872+O3872","v":0}]
[null,null,null,null,null,null,null,null,null,null,null,null,null,null,null,{"$f":"J3873+O3873","v":0}]
[null,null,null,null,null,null,null,null,null,null,null,null,null,null,null,{"$f":"J3874+O3874","v":0}]
[null,null,null,null,null,null,null,null,null,null,null,null,null,null,null,{"$f":"J3875+O3875","v":0}]
[null,null,null,null,null,null,null,null,null,null,null,null,null,null,null,{"$f":"J3876+O3876","v":0}]
[null,null,null,null,null,null,null,null,null,null,null,null,null,null,null,{"$f":"J3877+O3877","v":0}]
[null,null,null,null,null,null,null,null,null,null,null,null,null,null,null,{"$f":"J3878+O3878","v":0}]
[null,null,null,null,null,null,null,null,null,null,null,null,null,null,null,{"$f":"J3879+O3879","v":0}]
[null,null,null,null,null,null,null,null,null,null,null,null,null,null,null,{"$f":"J3880+O3880","v":0}]
[null,null,null,null,null,null,null,null,null,null,null,null,null,null,null,{"$f":"J3881+O3881","v":0}]
[null,null,null,null,null,null,null,null,null,null,null,null,null,null,null,{"$f":"J3882+O3882","v":0}]
[null,null,null,null,null,null,null,null,null,null,null,null,null,null,null,{"$f":"J3883+O3883","v":0}]
[null,null,null,null,null,null,null,null,null,null,null,null,null,null,null,{"$f":"J3884+O3884","v":0}]
[null,null,null,null,null,null,null,null,null,null,null,null,null,null,null,{"$f":"J3885+O3885","v":0}]
[null,null,null,null,null,null,null,null,null,null,null,null,null,null,null,{"$f":"J3886+O3886","v":0}]
[null,null,null,null,null,null,null,null,null,null,null,null,null,null,null,{"$f":"J3887+O3887","v":0}]
[null,null,null,null,null,null,null,null,null,null,null,null,null,null,null,{"$f":"J3888+O3888","v":0}]
[null,null,null,null,null,null,null,null,null,null,null,null,null,null,null,{"$f":"J3889+O3889","v":0}]
[null,null,null,null,null,null,null,null,null,null,null,null,null,null,null,{"$f":"J3890+O3890","v":0}]
[null,null,null,null,null,null,null,null,null,null,null,null,null,null,null,{"$f":"J3891+O3891","v":0}]
[null,null,null,null,null,null,null,null,null,null,null,null,null,null,null,{"$f":"J3892+O3892","v":0}]
[null,null,null,null,null,null,null,null,null,null,null,null,null,null,null,{"$f":"J3893+O3893","v":0}]
[null,null,null,null,null,null,null,null,null,null,null,null,null,null,null,{"$f":"J3894+O3894","v":0}]
[null,null,null,null,null,null,null,null,null,null,null,null,null,null,null,{"$f":"J3895+O3895","v":0}]
[null,null,null,null,null,null,null,null,null,null,null,null,null,null,null,{"$f":"J3896+O3896","v":0}]
[null,null,null,null,null,null,null,null,null,null,null,null,null,null,null,{"$f":"J3897+O3897","v":0}]
[null,null,null,null,null,null,null,null,null,null,null,null,null,null,null,{"$f":"J3898+O3898","v":0}]
[null,null,null,null,null,null,null,null,null,null,null,null,null,null,null,{"$f":"J3899+O3899","v":0}]
[null,null,null,null,null,null,null,null,null,null,null,null,null,null,null,{"$f":"J3900+O3900","v":0}]
[null,null,null,null,null,null,null,null,null,null,null,null,null,null,null,{"$f":"J3901+O3901","v":0}]
[null,null,null,null,null,null,null,null,null,null,null,null,null,null,null,{"$f":"J3902+O3902","v":0}]
[null,null,null,null,null,null,null,null,null,null,null,null,null,null,null,{"$f":"J3903+O3903","v":0}]
[null,null,null,null,null,null,null,null,null,null,null,null,null,null,null,{"$f":"J3904+O3904","v":0}]
[null,null,null,null,null,null,null,null,null,null,null,null,null,null,null,{"$f":"J3905+O3905","v":0}]
[null,null,null,null,null,null,null,null,null,null,null,null,null,null,null,{"$f":"J3906+O3906","v":0}]
[null,null,null,null,null,null,null,null,null,null,null,null,null,null,null,{"$f":"J3907+O3907","v":0}]
[null,null,null,null,null,null,null,null,null,null,null,null,null,null,null,{"$f":"J3908+O3908","v":0}]
[null,null,null,null,null,null,null,null,null,null,null,null,null,null,null,{"$f":"J3909+O3909","v":0}]
[null,null,null,null,null,null,null,null,null,null,null,null,null,null,null,{"$f":"J3910+O3910","v":0}]
[null,null,null,null,null,null,null,null,null,null,null,null,null,null,null,{"$f":"J3911+O3911","v":0}]
[null,null,null,null,null,null,null,null,null,null,null,null,null,null,null,{"$f":"J3912+O3912","v":0}]
[null,null,null,null,null,null,null,null,null,null,null,null,null,null,null,{"$f":"J3913+O3913","v":0}]
[null,null,null,null,null,null,null,null,null,null,null,null,null,null,null,{"$f":"J3914+O3914","v":0}]
[null,null,null,null,null,null,null,null,null,null,null,null,null,null,null,{"$f":"J3915+O3915","v":0}]
[null,null,null,null,null,null,null,null,null,null,null,null,null,null,null,{"$f":"J3916+O3916","v":0}]
[null,null,null,null,null,null,null,null,null,null,null,null,null,null,null,{"$f":"J3917+O3917","v":0}]
[null,null,null,null,null,null,null,null,null,null,null,null,null,null,null,{"$f":"J3918+O3918","v":0}]
[null,null,null,null,null,null,null,null,null,null,null,null,null,null,null,{"$f":"J3919+O3919","v":0}]
[null,null,null,null,null,null,null,null,null,null,null,null,null,null,null,{"$f":"J3920+O3920","v":0}]
[null,null,null,null,null,null,null,null,null,null,null,null,null,null,null,{"$f":"J3921+O3921","v":0}]
[null,null,null,null,null,null,null,null,null,null,null,null,null,null,null,{"$f":"J3922+O3922","v":0}]
[null,null,null,null,null,null,null,null,null,null,null,null,null,null,null,{"$f":"J3923+O3923","v":0}]
[null,null,null,null,null,null,null,null,null,null,null,null,null,null,null,{"$f":"J3924+O3924","v":0}]
[null,null,null,null,null,null,null,null,null,null,null,null,null,null,null,{"$f":"J3925+O3925","v":0}]
[null,null,null,null,null,null,null,null,null,null,null,null,null,null,null,{"$f":"J3926+O3926","v":0}]
[null,null,null,null,null,null,null,null,null,null,null,null,null,null,null,{"$f":"J3927+O3927","v":0}]
[null,null,null,null,null,null,null,null,null,null,null,null,null,null,null,{"$f":"J3928+O3928","v":0}]
[null,null,null,null,null,null,null,null,null,null,null,null,null,null,null,{"$f":"J3929+O3929","v":0}]
[null,null,null,null,null,null,null,null,null,null,null,null,null,null,null,{"$f":"J3930+O3930","v":0}]
[null,null,null,null,null,null,null,null,null,null,null,null,null,null,null,{"$f":"J3931+O3931","v":0}]
[null,null,null,null,null,null,null,null,null,null,null,null,null,null,null,{"$f":"J3932+O3932","v":0}]
[null,null,null,null,null,null,null,null,null,null,null,null,null,null,null,{"$f":"J3933+O3933","v":0}]
[null,null,null,null,null,null,null,null,null,null,null,null,null,null,null,{"$f":"J3934+O3934","v":0}]
[null,null,null,null,null,null,null,null,null,null,null,null,null,null,null,{"$f":"J3935+O3935","v":0}]
[null,null,null,null,null,null,null,null,null,null,null,null,null,null,null,{"$f":"J3936+O3936","v":0}]
[null,null,null,null,null,null,null,null,null,null,null,null,null,null,null,{"$f":"J3937+O3937","v":0}]
[null,null,null,null,null,null,null,null,null,null,null,null,null,null,null,{"$f":"J3938+O3938","v":0}]
[null,null,null,null,null,null,null,null,null,null,null,null,null,null,null,{"$f":"J3939+O3939","v":0}]
[null,null,null,null,null,null,null,null,null,null,null,null,null,null,null,{"$f":"J3940+O3940","v":0}]
[null,null,null,null,null,null,null,null,null,null,null,null,null,null,null,{"$f":"J3941+O3941","v":0}]
[null,null,null,null,null,null,null,null,null,null,null,null,null,null,null,{"$f":"J3942+O3942","v":0}]
[null,null,null,null,null,null,null,null,null,null,null,null,null,null,null,{"$f":"J3943+O3943","v":0}]
[null,null,null,null,null,null,null,null,null,null,null,null,null,null,null,{"$f":"J3944+O3944","v":0}]
[null,null,null,null,null,null,null,null,null,null,null,null,null,null,null,{"$f":"J3945+O3945","v":0}]
[null,null,null,null,null,null,null,null,null,null,null,null,null,null,null,{"$f":"J3946+O3946","v":0}]
[null,null,null,null,null,null,null,null,null,null,null,null,null,null,null,{"$f":"J3947+O3947","v":0}]
[null,null,null,null,null,null,null,null,null,null,null,null,null,null,null,{"$f":"J3948+O3948","v":0}]
[null,null,null,null,null,null,null,null,null,null,null,null,null,null,null,{"$f":"J3949+O3949","v":0}]
[null,null,null,null,null,null,null,null,null,null,null,null,null,null,null,{"$f":"J3950+O3950","v":0}]
[null,null,null,null,null,null,null,null,null,null,null,null,null,null,null,{"$f":"J3951+O3951","v":0}]
[null,null,null,null,null,null,null,null,null,null,null,null,null,null,null,{"$f":"J3952+O3952","v":0}]
[null,null,null,null,null,null,null,null,null,null,null,null,null,null,null,{"$f":"J3953+O3953","v":0}]
[null,null,null,null,null,null,null,null,null,null,null,null,null,null,null,{"$f":"J3954+O3954","v":0}]
[null,null,null,null,null,null,null,null,null,null,null,null,null,null,null,{"$f":"J3955+O3955","v":0}]
[null,null,null,null,null,null,null,null,null,null,null,null,null,null,null,{"$f":"J3956+O3956","v":0}]
[null,null,null,null,null,null,null,null,null,null,null,null,null,null,null,{"$f":"J3957+O3957","v":0}]
[null,null,null,null,null,null,null,null,null,null,null,null,null,null,null,{"$f":"J3958+O3958","v":0}]
[null,null,null,null,null,null,null,null,null,null,null,null,null,null,null,{"$f":"J3959+O3959","v":0}]
[null,null,null,null,null,null,null,null,null,null,null,null,null,null,null,{"$f":"J3960+O3960","v":0}]
[null,null,null,null,null,null,null,null,null,null,null,null,null,null,null,{"$f":"J3961+O3961","v":0}]
[null,null,null,null,null,null,null,null,null,null,null,null,null,null,null,{"$f":"J3962+O3962","v":0}]
[null,null,null,null,null,null,null,null,null,null,null,null,null,null,null,{"$f":"J3963+O3963","v":0}]
[null,null,null,null,null,null,null,null,null,null,null,null,null,null,null,{"$f":"J3964+O3964","v":0}]
[null,null,null,null,null,null,null,null,null,null,null,null,null,null,null,{"$f":"J3965+O3965","v":0}]
[null,null,null,null,null,null,null,null,null,null,null,null,null,null,null,{"$f":"J3966+O3966","v":0}]
[null,null,null,null,null,null,null,null,null,null,null,null,null,null,null,{"$f":"J3967+O3967","v":0}]
[null,null,null,null,null,null,null,null,null,null,null,null,null,null,null,{"$f":"J3968+O3968","v":0}]
[null,null,null,null,null,null,null,null,null,null,null,null,null,null,null,{"$f":"J3969+O3969","v":0}]
[null,null,null,null,null,null,null,null,null,null,null,null,null,null,null,{"$f":"J3970+O3970","v":0}]
[null,null,null,null,null,null,null,null,null,null,null,null,null,null,null,{"$f":"J3971+O3971","v":0}]
[null,null,null,null,null,null,null,null,null,null,null,null,null,null,null,{"$f":"J3972+O3972","v":0}]
[null,null,null,null,null,null,null,null,null,null,null,null,null,null,null,{"$f":"J3973+O3973","v":0}]
[null,null,null,null,null,null,null,null,null,null,null,null,null,null,null,{"$f":"J3974+O3974","v":0}]
[null,null,null,null,null,null,null,null,null,null,null,null,null,null,null,{"$f":"J3975+O3975","v":0}]
[null,null,null,null,null,null,null,null,null,null,null,null,null,null,null,{"$f":"J3976+O3976","v":0}]
[null,null,null,null,null,null,null,null,null,null,null,null,null,null,null,{"$f":"J3977+O3977","v":0}]
[null,null,null,null,null,null,null,null,null,null,null,null,null,null,null,{"$f":"J3978+O3978","v":0}]
[null,null,null,null,null,null,null,null,null,null,null,null,null,null,null,{"$f":"J3979+O3979","v":0}]
[null,null,null,null,null,null,null,null,null,null,null,null,null,null,null,{"$f":"J3980+O3980","v":0}]
[null,null,null,null,null,null,null,null,null,null,null,null,null,null,null,{"$f":"J3981+O3981","v":0}]
[null,null,null,null,null,null,null,null,null,null,null,null,null,null,null,{"$f":"J3982+O3982","v":0}]
[null,null,null,null,null,null,null,null,null,null,null,null,null,null,null,{"$f":"J3983+O3983","v":0}]
[null,null,null,null,null,null,null,null,null,null,null,null,null,null,null,{"$f":"J3984+O3984","v":0}]
[null,null,null,null,null,null,null,null,null,null,null,null,null,null,null,{"$f":"J3985+O3985","v":0}]
[null,null,null,null,null,null,null,null,null,null,null,null,null,null,null,{"$f":"J3986+O3986","v":0}]
[null,null,null,null,null,null,null,null,null,null,null,null,null,null,null,{"$f":"J3987+O3987","v":0}]
[null,null,null,null,null,null,null,null,null,null,null,null,null,null,null,{"$f":"J3988+O3988","v":0}]
[null,null,null,null,null,null,null,null,null,null,null,null,null,null,null,{"$f":"J3989+O3989","v":0}]
[null,null,null,null,null,null,null,null,null,null,null,null,null,null,null,{"$f":"J3990+O3990","v":0}]
[null,null,null,null,null,null,null,null,null,null,null,null,null,null,null,{"$f":"J3991+O3991","v":0}]
[null,null,null,null,null,null,null,null,null,null,null,null,null,null,null,{"$f":"J3992+O3992","v":0}]
[null,null,null,null,null,null,null,null,null,null,null,null,null,null,null,{"$f":"J3993+O3993","v":0}]
[null,null,null,null,null,null,null,null,null,null,null,null,null,null,null,{"$f":"J3994+O3994","v":0}]
[null,null,null,null,null,null,null,null,null,null,null,null,null,null,null,{"$f":"J3995+O3995","v":0}]
[null,null,null,null,null,null,null,null,null,null,null,null,null,null,null,{"$f":"J3996+O3996","v":0}]
[null,null,null,null,null,null,null,null,null,null,null,null,null,null,null,{"$f":"J3997+O3997","v":0}]
[null,null,null,null,null,null,null,null,null,null,null,null,null,null,null,{"$f":"J3998+O3998","v":0}]
[null,null,null,null,null,null,null,null,null,null,null,null,null,null,null,{"$f":"J3999+O3999","v":0}]
[null,null,null,null,null,null,null,null,null,null,null,null,null,null,null,{"$f":"J4000+O4000","v":0}]
[null,null,null,null,null,null,null,null,null,null,null,null,null,null,null,{"$f":"J4001+O4001","v":0}]
[null,null,null,null,null,null,null,null,null,null,null,null,null,null,null,{"$f":"J4002+O4002","v":0}]
[null,null,null,null,null,null,null,null,null,null,null,null,null,null,null,{"$f":"J4003+O4003","v":0}]
[null,null,null,null,null,null,null,null,null,null,null,null,null,null,null,{"$f":"J4004+O4004","v":0}]
[null,null,null,null,null,null,null,null,null,null,null,null,null,null,null,{"$f":"J4005+O4005","v":0}]
[null,null,null,null,null,null,null,null,null,null,null,null,null,null,null,{"$f":"J4006+O4006","v":0}]
[null,null,null,null,null,null,null,null,null,null,null,null,null,null,null,{"$f":"J4007+O4007","v":0}]
[null,null,null,null,null,null,null,null,null,null,null,null,null,null,null,{"$f":"J4008+O4008","v":0}]
[null,null,null,null,null,null,null,null,null,null,null,null,null,null,null,{"$f":"J4009+O4009","v":0}]
[null,null,null,null,null,null,null,null,null,null,null,null,null,null,null,{"$f":"J4010+O4010","v":0}]
[null,null,null,null,null,null,null,null,null,null,null,null,null,null,null,{"$f":"J4011+O4011","v":0}]
[null,null,null,null,null,null,null,null,null,null,null,null,null,null,null,{"$f":"J4012+O4012","v":0}]
[null,null,null,null,null,null,null,null,null,null,null,null,null,null,null,{"$f":"J4013+O4013","v":0}]
[null,null,null,null,null,null,null,null,null,null,null,null,null,null,null,{"$f":"J4014+O4014","v":0}]
[null,null,null,null,null,null,null,null,null,null,null,null,null,null,null,{"$f":"J4015+O4015","v":0}]
[null,null,null,null,null,null,null,null,null,null,null,null,null,null,null,{"$f":"J4016+O4016","v":0}]
[null,null,null,null,null,null,null,null,null,null,null,null,null,null,null,{"$f":"J4017+O4017","v":0}]
[null,null,null,null,null,null,null,null,null,null,null,null,null,null,null,{"$f":"J4018+O4018","v":0}]
[null,null,null,null,null,null,null,null,null,null,null,null,null,null,null,{"$f":"J4019+O4019","v":0}]
[null,null,null,null,null,null,null,null,null,null,null,null,null,null,null,{"$f":"J4020+O4020","v":0}]
[null,null,null,null,null,null,null,null,null,null,null,null,null,null,null,{"$f":"J4021+O4021","v":0}]
[null,null,null,null,null,null,null,null,null,null,null,null,null,null,null,{"$f":"J4022+O4022","v":0}]
[null,null,null,null,null,null,null,null,null,null,null,null,null,null,null,{"$f":"J4023+O4023","v":0}]
[null,null,null,null,null,null,null,null,null,null,null,null,null,null,null,{"$f":"J4024+O4024","v":0}]
[null,null,null,null,null,null,null,null,null,null,null,null,null,null,null,{"$f":"J4025+O4025","v":0}]
[null,null,null,null,null,null,null,null,null,null,null,null,null,null,null,{"$f":"J4026+O4026","v":0}]
[null,null,null,null,null,null,null,null,null,null,null,null,null,null,null,{"$f":"J4027+O4027","v":0}]
[null,null,null,null,null,null,null,null,null,null,null,null,null,null,null,{"$f":"J4028+O4028","v":0}]
[null,null,null,null,null,null,null,null,null,null,null,null,null,null,null,{"$f":"J4029+O4029","v":0}]
[null,null,null,null,null,null,null,null,null,null,null,null,null,null,null,{"$f":"J4030+O4030","v":0}]
[null,null,null,null,null,null,null,null,null,null,null,null,null,null,null,{"$f":"J4031+O4031","v":0}]
[null,null,null,null,null,null,null,null,null,null,null,null,null,null,null,{"$f":"J4032+O4032","v":0}]
[null,null,null,null,null,null,null,null,null,null,null,null,null,null,null,{"$f":"J4033+O4033","v":0}]
[null,null,null,null,null,null,null,null,null,null,null,null,null,null,null,{"$f":"J4034+O4034","v":0}]
[null,null,null,null,null,null,null,null,null,null,null,null,null,null,null,{"$f":"J4035+O4035","v":0}]
[null,null,null,null,null,null,null,null,null,null,null,null,null,null,null,{"$f":"J4036+O4036","v":0}]
[null,null,null,null,null,null,null,null,null,null,null,null,null,null,null,{"$f":"J4037+O4037","v":0}]
[null,null,null,null,null,null,null,null,null,null,null,null,null,null,null,{"$f":"J4038+O4038","v":0}]
[null,null,null,null,null,null,null,null,null,null,null,null,null,null,null,{"$f":"J4039+O4039","v":0}]
[null,null,null,null,null,null,null,null,null,null,null,null,null,null,null,{"$f":"J4040+O4040","v":0}]
[null,null,null,null,null,null,null,null,null,null,null,null,null,null,null,{"$f":"J4041+O4041","v":0}]
[null,null,null,null,null,null,null,null,null,null,null,null,null,null,null,{"$f":"J4042+O4042","v":0}]
[null,null,null,null,null,null,null,null,null,null,null,null,null,null,null,{"$f":"J4043+O4043","v":0}]
[null,null,null,null,null,null,null,null,null,null,null,null,null,null,null,{"$f":"J4044+O4044","v":0}]
[null,null,null,null,null,null,null,null,null,null,null,null,null,null,null,{"$f":"J4045+O4045","v":0}]
[null,null,null,null,null,null,null,null,null,null,null,null,null,null,null,{"$f":"J4046+O4046","v":0}]
[null,null,null,null,null,null,null,null,null,null,null,null,null,null,null,{"$f":"J4047+O4047","v":0}]
[null,null,null,null,null,null,null,null,null,null,null,null,null,null,null,{"$f":"J4048+O4048","v":0}]
[null,null,null,null,null,null,null,null,null,null,null,null,null,null,null,{"$f":"J4049+O4049","v":0}]
[null,null,null,null,null,null,null,null,null,null,null,null,null,null,null,{"$f":"J4050+O4050","v":0}]
[null,null,null,null,null,null,null,null,null,null,null,null,null,null,null,{"$f":"J4051+O4051","v":0}]
[null,null,null,null,null,null,null,null,null,null,null,null,null,null,null,{"$f":"J4052+O4052","v":0}]
[null,null,null,null,null,null,null,null,null,null,null,null,null,null,null,{"$f":"J4053+O4053","v":0}]
[null,null,null,null,null,null,null,null,null,null,null,null,null,null,null,{"$f":"J4054+O4054","v":0}]
[null,null,null,null,null,null,null,null,null,null,null,null,null,null,null,{"$f":"J4055+O4055","v":0}]
[null,null,null,null,null,null,null,null,null,null,null,null,null,null,null,{"$f":"J4056+O4056","v":0}]
[null,null,null,null,null,null,null,null,null,null,null,null,null,null,null,{"$f":"J4057+O4057","v":0}]
[null,null,null,null,null,null,null,null,null,null,null,null,null,null,null,{"$f":"J4058+O4058","v":0}]
[null,null,null,null,null,null,null,null,null,null,null,null,null,null,null,{"$f":"J4059+O4059","v":0}]
[null,null,null,null,null,null,null,null,null,null,null,null,null,null,null,{"$f":"J4060+O4060","v":0}]
[null,null,null,null,null,null,null,null,null,null,null,null,null,null,null,{"$f":"J4061+O4061","v":0}]
[null,null,null,null,null,null,null,null,null,null,null,null,null,null,null,{"$f":"J4062+O4062","v":0}]
[null,null,null,null,null,null,null,null,null,null,null,null,null,null,null,{"$f":"J4063+O4063","v":0}]
[null,null,null,null,null,null,null,null,null,null,null,null,null,null,null,{"$f":"J4064+O4064","v":0}]
[null,null,null,null,null,null,null,null,null,null,null,null,null,null,null,{"$f":"J4065+O4065","v":0}]
[null,null,null,null,null,null,null,null,null,null,null,null,null,null,null,{"$f":"J4066+O4066","v":0}]
[null,null,null,null,null,null,null,null,null,null,null,null,null,null,null,{"$f":"J4067+O4067","v":0}]
[null,null,null,null,null,null,null,null,null,null,null,null,null,null,null,{"$f":"J4068+O4068","v":0}]
[null,null,null,null,null,null,null,null,null,null,null,null,null,null,null,{"$f":"J4069+O4069","v":0}]
[null,null,null,null,null,null,null,null,null,null,null,null,null,null,null,{"$f":"J4070+O4070","v":0}]
[null,null,null,null,null,null,null,null,null,null,null,null,null,null,null,{"$f":"J4071+O4071","v":0}]
[null,null,null,null,null,null,null,null,null,null,null,null,null,null,null,{"$f":"J4072+O4072","v":0}]
[null,null,null,null,null,null,null,null,null,null,null,null,null,null,null,{"$f":"J4073+O4073","v":0}]
[null,null,null,null,null,null,null,null,null,null,null,null,null,null,null,{"$f":"J4074+O4074","v":0}]
[null,null,null,null,null,null,null,null,null,null,null,null,null,null,null,{"$f":"J4075+O4075","v":0}]
[null,null,null,null,null,null,null,null,null,null,null,null,null,null,null,{"$f":"J4076+O4076","v":0}]
[null,null,null,null,null,null,null,null,null,null,null,null,null,null,null,{"$f":"J4077+O4077","v":0}]
[null,null,null,null,null,null,null,null,null,null,null,null,null,null,null,{"$f":"J4078+O4078","v":0}]
[null,null,null,null,null,null,null,null,null,null,null,null,null,null,null,{"$f":"J4079+O4079","v":0}]
[null,null,null,null,null,null,null,null,null,null,null,null,null,null,null,{"$f":"J4080+O4080","v":0}]
[null,null,null,null,null,null,null,null,null,null,null,null,null,null,null,{"$f":"J4081+O4081","v":0}]
[null,null,null,null,null,null,null,null,null,null,null,null,null,null,null,{"$f":"J4082+O4082","v":0}]
[null,null,null,null,null,null,null,null,null,null,null,null,null,null,null,{"$f":"J4083+O4083","v":0}]
[null,null,null,null,null,null,null,null,null,null,null,null,null,null,null,{"$f":"J4084+O4084","v":0}]
[null,null,null,null,null,null,null,null,null,null,null,null,null,null,null,{"$f":"J4085+O4085","v":0}]
[null,null,null,null,null,null,null,null,null,null,null,null,null,null,null,{"$f":"J4086+O4086","v":0}]
[null,null,null,null,null,null,null,null,null,null,null,null,null,null,null,{"$f":"J4087+O4087","v":0}]
[null,null,null,null,null,null,null,null,null,null,null,null,null,null,null,{"$f":"J4088+O4088","v":0}]
[null,null,null,null,null,null,null,null,null,null,null,null,null,null,null,{"$f":"J4089+O4089","v":0}]
[null,null,null,null,null,null,null,null,null,null,null,null,null,null,null,{"$f":"J4090+O4090","v":0}]
[null,null,null,null,null,null,null,null,null,null,null,null,null,null,null,{"$f":"J4091+O4091","v":0}]
[null,null,null,null,null,null,null,null,null,null,null,null,null,null,null,{"$f":"J4092+O4092","v":0}]
[null,null,null,null,null,null,null,null,null,null,null,null,null,null,null,{"$f":"J4093+O4093","v":0}]
[null,null,null,null,null,null,null,null,null,null,null,null,null,null,null,{"$f":"J4094+O4094","v":0}]
[null,null,null,null,null,null,null,null,null,null,null,null,null,null,null,{"$f":"J4095+O4095","v":0}]
[null,null,null,null,null,null,null,null,null,null,null,null,null,null,null,{"$f":"J4096+O4096","v":0}]
[null,null,null,null,null,null,null,null,null,null,null,null,null,null,null,{"$f":"J4097+O4097","v":0}]
[null,null,null,null,null,null,null,null,null,null,null,null,null,null,null,{"$f":"J4098+O4098","v":0}]
[null,null,null,null,null,null,null,null,null,null,null,null,null,null,null,{"$f":"J4099+O4099","v":0}]
[null,null,null,null,null,null,null,null,null,null,null,null,null,null,null,{"$f":"J4100+O4100","v":0}]
[null,null,null,null,null,null,null,null,null,null,null,null,null,null,null,{"$f":"J4101+O4101","v":0}]
[null,null,null,null,null,null,null,null,null,null,null,null,null,null,null,{"$f":"J4102+O4102","v":0}]
[null,null,null,null,null,null,null,null,null,null,null,null,null,null,null,{"$f":"J4103+O4103","v":0}]
[null,null,null,null,null,null,null,null,null,null,null,null,null,null,null,{"$f":"J4104+O4104","v":0}]
[null,null,null,null,null,null,null,null,null,null,null,null,null,null,null,{"$f":"J4105+O4105","v":0}]
[null,null,null,null,null,null,null,null,null,null,null,null,null,null,null,{"$f":"J4106+O4106","v":0}]
[null,null,null,null,null,null,null,null,null,null,null,null,null,null,null,{"$f":"J4107+O4107","v":0}]
[null,null,null,null,null,null,null,null,null,null,null,null,null,null,null,{"$f":"J4108+O4108","v":0}]
[null,null,null,null,null,null,null,null,null,null,null,null,null,null,null,{"$f":"J4109+O4109","v":0}]
[null,null,null,null,null,null,null,null,null,null,null,null,null,null,null,{"$f":"J4110+O4110","v":0}]
[null,null,null,null,null,null,null,null,null,null,null,null,null,null,null,{"$f":"J4111+O4111","v":0}]
[null,null,null,null,null,null,null,null,null,null,null,null,null,null,null,{"$f":"J4112+O4112","v":0}]
[null,null,null,null,null,null,null,null,null,null,null,null,null,null,null,{"$f":"J4113+O4113","v":0}]
[null,null,null,null,null,null,null,null,null,null,null,null,null,null,null,{"$f":"J4114+O4114","v":0}]
[null,null,null,null,null,null,null,null,null,null,null,null,null,null,null,{"$f":"J4115+O4115","v":0}]
[null,null,null,null,null,null,null,null,null,null,null,null,null,null,null,{"$f":"J4116+O4116","v":0}]
[null,null,null,null,null,null,null,null,null,null,null,null,null,null,null,{"$f":"J4117+O4117","v":0}]
[null,null,null,null,null,null,null,null,null,null,null,null,null,null,null,{"$f":"J4118+O4118","v":0}]
[null,null,null,null,null,null,null,null,null,null,null,null,null,null,null,{"$f":"J4119+O4119","v":0}]
[null,null,null,null,null,null,null,null,null,null,null,null,null,null,null,{"$f":"J4120+O4120","v":0}]
[null,null,null,null,null,null,null,null,null,null,null,null,null,null,null,{"$f":"J4121+O4121","v":0}]
[null,null,null,null,null,null,null,null,null,null,null,null,null,null,null,{"$f":"J4122+O4122","v":0}]
[null,null,null,null,null,null,null,null,null,null,null,null,null,null,null,{"$f":"J4123+O4123","v":0}]
[null,null,null,null,null,null,null,null,null,null,null,null,null,null,null,{"$f":"J4124+O4124","v":0}]
[null,null,null,null,null,null,null,null,null,null,null,null,null,null,null,{"$f":"J4125+O4125","v":0}]
[null,null,null,null,null,null,null,null,null,null,null,null,null,null,null,{"$f":"J4126+O4126","v":0}]
[null,null,null,null,null,null,null,null,null,null,null,null,null,null,null,{"$f":"J4127+O4127","v":0}]
[null,null,null,null,null,null,null,null,null,null,null,null,null,null,null,{"$f":"J4128+O4128","v":0}]
[null,null,null,null,null,null,null,null,null,null,null,null,null,null,null,{"$f":"J4129+O4129","v":0}]
[null,null,null,null,null,null,null,null,null,null,null,null,null,null,null,{"$f":"J4130+O4130","v":0}]
[null,null,null,null,null,null,null,null,null,null,null,null,null,null,null,{"$f":"J4131+O4131","v":0}]
[null,null,null,null,null,null,null,null,null,null,null,null,null,null,null,{"$f":"J4132+O4132","v":0}]
[null,null,null,null,null,null,null,null,null,null,null,null,null,null,null,{"$f":"J4133+O4133","v":0}]
[null,null,null,null,null,null,null,null,null,null,null,null,null,null,null,{"$f":"J4134+O4134","v":0}]
[null,null,null,null,null,null,null,null,null,null,null,null,null,null,null,{"$f":"J4135+O4135","v":0}]
[null,null,null,null,null,null,null,null,null,null,null,null,null,null,null,{"$f":"J4136+O4136","v":0}]
[null,null,null,null,null,null,null,null,null,null,null,null,null,null,null,{"$f":"J4137+O4137","v":0}]
[null,null,null,null,null,null,null,null,null,null,null,null,null,null,null,{"$f":"J4138+O4138","v":0}]
[null,null,null,null,null,null,null,null,null,null,null,null,null,null,null,{"$f":"J4139+O4139","v":0}]
[null,null,null,null,null,null,null,null,null,null,null,null,null,null,null,{"$f":"J4140+O4140","v":0}]
[null,null,null,null,null,null,null,null,null,null,null,null,null,null,null,{"$f":"J4141+O4141","v":0}]
[null,null,null,null,null,null,null,null,null,null,null,null,null,null,null,{"$f":"J4142+O4142","v":0}]
[null,null,null,null,null,null,null,null,null,null,null,null,null,null,null,{"$f":"J4143+O4143","v":0}]
[null,null,null,null,null,null,null,null,null,null,null,null,null,null,null,{"$f":"J4144+O4144","v":0}]
[null,null,null,null,null,null,null,null,null,null,null,null,null,null,null,{"$f":"J4145+O4145","v":0}]
[null,null,null,null,null,null,null,null,null,null,null,null,null,null,null,{"$f":"J4146+O4146","v":0}]
[null,null,null,null,null,null,null,null,null,null,null,null,null,null,null,{"$f":"J4147+O4147","v":0}]
[null,null,null,null,null,null,null,null,null,null,null,null,null,null,null,{"$f":"J4148+O4148","v":0}]
[null,null,null,null,null,null,null,null,null,null,null,null,null,null,null,{"$f":"J4149+O4149","v":0}]
[null,null,null,null,null,null,null,null,null,null,null,null,null,null,null,{"$f":"J4150+O4150","v":0}]
[null,null,null,null,null,null,null,null,null,null,null,null,null,null,null,{"$f":"J4151+O4151","v":0}]
[null,null,null,null,null,null,null,null,null,null,null,null,null,null,null,{"$f":"J4152+O4152","v":0}]
[null,null,null,null,null,null,null,null,null,null,null,null,null,null,null,{"$f":"J4153+O4153","v":0}]
[null,null,null,null,null,null,null,null,null,null,null,null,null,null,null,{"$f":"J4154+O4154","v":0}]
[null,null,null,null,null,null,null,null,null,null,null,null,null,null,null,{"$f":"J4155+O4155","v":0}]
[null,null,null,null,null,null,null,null,null,null,null,null,null,null,null,{"$f":"J4156+O4156","v":0}]
[null,null,null,null,null,null,null,null,null,null,null,null,null,null,null,{"$f":"J4157+O4157","v":0}]
[null,null,null,null,null,null,null,null,null,null,null,null,null,null,null,{"$f":"J4158+O4158","v":0}]
[null,null,null,null,null,null,null,null,null,null,null,null,null,null,null,{"$f":"J4159+O4159","v":0}]
[null,null,null,null,null,null,null,null,null,null,null,null,null,null,null,{"$f":"J4160+O4160","v":0}]
[null,null,null,null,null,null,null,null,null,null,null,null,null,null,null,{"$f":"J4161+O4161","v":0}]
[null,null,null,null,null,null,null,null,null,null,null,null,null,null,null,{"$f":"J4162+O4162","v":0}]
[null,null,null,null,null,null,null,null,null,null,null,null,null,null,null,{"$f":"J4163+O4163","v":0}]
[null,null,null,null,null,null,null,null,null,null,null,null,null,null,null,{"$f":"J4164+O4164","v":0}]
[null,null,null,null,null,null,null,null,null,null,null,null,null,null,null,{"$f":"J4165+O4165","v":0}]
[null,null,null,null,null,null,null,null,null,null,null,null,null,null,null,{"$f":"J4166+O4166","v":0}]
[null,null,null,null,null,null,null,null,null,null,null,null,null,null,null,{"$f":"J4167+O4167","v":0}]
[null,null,null,null,null,null,null,null,null,null,null,null,null,null,null,{"$f":"J4168+O4168","v":0}]
[null,null,null,null,null,null,null,null,null,null,null,null,null,null,null,{"$f":"J4169+O4169","v":0}]
[null,null,null,null,null,null,null,null,null,null,null,null,null,null,null,{"$f":"J4170+O4170","v":0}]
[null,null,null,null,null,null,null,null,null,null,null,null,null,null,null,{"$f":"J4171+O4171","v":0}]
[null,null,null,null,null,null,null,null,null,null,null,null,null,null,null,{"$f":"J4172+O4172","v":0}]
[null,null,null,null,null,null,null,null,null,null,null,null,null,null,null,{"$f":"J4173+O4173","v":0}]
[null,null,null,null,null,null,null,null,null,null,null,null,null,null,null,{"$f":"J4174+O4174","v":0}]
[null,null,null,null,null,null,null,null,null,null,null,null,null,null,null,{"$f":"J4175+O4175","v":0}]
[null,null,null,null,null,null,null,null,null,null,null,null,null,null,null,{"$f":"J4176+O4176","v":0}]
[null,null,null,null,null,null,null,null,null,null,null,null,null,null,null,{"$f":"J4177+O4177","v":0}]
[null,null,null,null,null,null,null,null,null,null,null,null,null,null,null,{"$f":"J4178+O4178","v":0}]
[null,null,null,null,null,null,null,null,null,null,null,null,null,null,null,{"$f":"J4179+O4179","v":0}]
[null,null,null,null,null,null,null,null,null,null,null,null,null,null,null,{"$f":"J4180+O4180","v":0}]
[null,null,null,null,null,null,null,null,null,null,null,null,null,null,null,{"$f":"J4181+O4181","v":0}]
[null,null,null,null,null,null,null,null,null,null,null,null,null,null,null,{"$f":"J4182+O4182","v":0}]
[null,null,null,null,null,null,null,null,null,null,null,null,null,null,null,{"$f":"J4183+O4183","v":0}]
[null,null,null,null,null,null,null,null,null,null,null,null,null,null,null,{"$f":"J4184+O4184","v":0}]
[null,null,null,null,null,null,null,null,null,null,null,null,null,null,null,{"$f":"J4185+O4185","v":0}]
[null,null,null,null,null,null,null,null,null,null,null,null,null,null,null,{"$f":"J4186+O4186","v":0}]
[null,null,null,null,null,null,null,null,null,null,null,null,null,null,null,{"$f":"J4187+O4187","v":0}]
[null,null,null,null,null,null,null,null,null,null,null,null,null,null,null,{"$f":"J4188+O4188","v":0}]
[null,null,null,null,null,null,null,null,null,null,null,null,null,null,null,{"$f":"J4189+O4189","v":0}]
[null,null,null,null,null,null,null,null,null,null,null,null,null,null,null,{"$f":"J4190+O4190","v":0}]
[null,null,null,null,null,null,null,null,null,null,null,null,null,null,null,{"$f":"J4191+O4191","v":0}]
[null,null,null,null,null,null,null,null,null,null,null,null,null,null,null,{"$f":"J4192+O4192","v":0}]
[null,null,null,null,null,null,null,null,null,null,null,null,null,null,null,{"$f":"J4193+O4193","v":0}]
[null,null,null,null,null,null,null,null,null,null,null,null,null,null,null,{"$f":"J4194+O4194","v":0}]
[null,null,null,null,null,null,null,null,null,null,null,null,null,null,null,{"$f":"J4195+O4195","v":0}]
[null,null,null,null,null,null,null,null,null,null,null,null,null,null,null,{"$f":"J4196+O4196","v":0}]
[null,null,null,null,null,null,null,null,null,null,null,null,null,null,null,{"$f":"J4197+O4197","v":0}]
[null,null,null,null,null,null,null,null,null,null,null,null,null,null,null,{"$f":"J4198+O4198","v":0}]
[null,null,null,null,null,null,null,null,null,null,null,null,null,null,null,{"$f":"J4199+O4199","v":0}]
[null,null,null,null,null,null,null,null,null,null,null,null,null,null,null,{"$f":"J4200+O4200","v":0}]
[null,null,null,null,null,null,null,null,null,null,null,null,null,null,null,{"$f":"J4201+O4201","v":0}]
[null,null,null,null,null,null,null,null,null,null,null,null,null,null,null,{"$f":"J4202+O4202","v":0}]
[null,null,null,null,null,null,null,null,null,null,null,null,null,null,null,{"$f":"J4203+O4203","v":0}]
[null,null,null,null,null,null,null,null,null,null,null,null,null,null,null,{"$f":"J4204+O4204","v":0}]
[null,null,null,null,null,null,null,null,null,null,null,null,null,null,null,{"$f":"J4205+O4205","v":0}]
[null,null,null,null,null,null,null,null,null,null,null,null,null,null,null,{"$f":"J4206+O4206","v":0}]
[null,null,null,null,null,null,null,null,null,null,null,null,null,null,null,{"$f":"J4207+O4207","v":0}]
[null,null,null,null,null,null,null,null,null,null,null,null,null,null,null,{"$f":"J4208+O4208","v":0}]
[null,null,null,null,null,null,null,null,null,null,null,null,null,null,null,{"$f":"J4209+O4209","v":0}]
[null,null,null,null,null,null,null,null,null,null,null,null,null,null,null,{"$f":"J4210+O4210","v":0}]
[null,null,null,null,null,null,null,null,null,null,null,null,null,null,null,{"$f":"J4211+O4211","v":0}]
[null,null,null,null,null,null,null,null,null,null,null,null,null,null,null,{"$f":"J4212+O4212","v":0}]
[null,null,null,null,null,null,null,null,null,null,null,null,null,null,null,{"$f":"J4213+O4213","v":0}]
[null,null,null,null,null,null,null,null,null,null,null,null,null,null,null,{"$f":"J4214+O4214","v":0}]
[null,null,null,null,null,null,null,null,null,null,null,null,null,null,null,{"$f":"J4215+O4215","v":0}]
[null,null,null,null,null,null,null,null,null,null,null,null,null,null,null,{"$f":"J4216+O4216","v":0}]
[null,null,null,null,null,null,null,null,null,null,null,null,null,null,null,{"$f":"J4217+O4217","v":0}]
[null,null,null,null,null,null,null,null,null,null,null,null,null,null,null,{"$f":"J4218+O4218","v":0}]
[null,null,null,null,null,null,null,null,null,null,null,null,null,null,null,{"$f":"J4219+O4219","v":0}]
[null,null,null,null,null,null,null,null,null,null,null,null,null,null,null,{"$f":"J4220+O4220","v":0}]
[null,null,null,null,null,null,null,null,null,null,null,null,null,null,null,{"$f":"J4221+O4221","v":0}]
[null,null,null,null,null,null,null,null,null,null,null,null,null,null,null,{"$f":"J4222+O4222","v":0}]
[null,null,null,null,null,null,null,null,null,null,null,null,null,null,null,{"$f":"J4223+O4223","v":0}]
[null,null,null,null,null,null,null,null,null,null,null,null,null,null,null,{"$f":"J4224+O4224","v":0}]
[null,null,null,null,null,null,null,null,null,null,null,null,null,null,null,{"$f":"J4225+O4225","v":0}]
[null,null,null,null,null,null,null,null,null,null,null,null,null,null,null,{"$f":"J4226+O4226","v":0}]
[null,null,null,null,null,null,null,null,null,null,null,null,null,null,null,{"$f":"J4227+O4227","v":0}]
[null,null,null,null,null,null,null,null,null,null,null,null,null,null,null,{"$f":"J4228+O4228","v":0}]
[null,null,null,null,null,null,null,null,null,null,null,null,null,null,null,{"$f":"J4229+O4229","v":0}]
[null,null,null,null,null,null,null,null,null,null,null,null,null,null,null,{"$f":"J4230+O4230","v":0}]
[null,null,null,null,null,null,null,null,null,null,null,null,null,null,null,{"$f":"J4231+O4231","v":0}]
[null,null,null,null,null,null,null,null,null,null,null,null,null,null,null,{"$f":"J4232+O4232","v":0}]
[null,null,null,null,null,null,null,null,null,null,null,null,null,null,null,{"$f":"J4233+O4233","v":0}]
[null,null,null,null,null,null,null,null,null,null,null,null,null,null,null,{"$f":"J4234+O4234","v":0}]
[null,null,null,null,null,null,null,null,null,null,null,null,null,null,null,{"$f":"J4235+O4235","v":0}]
[null,null,null,null,null,null,null,null,null,null,null,null,null,null,null,{"$f":"J4236+O4236","v":0}]
[null,null,null,null,null,null,null,null,null,null,null,null,null,null,null,{"$f":"J4237+O4237","v":0}]
[null,null,null,null,null,null,null,null,null,null,null,null,null,null,null,{"$f":"J4238+O4238","v":0}]
[null,null,null,null,null,null,null,null,null,null,null,null,null,null,null,{"$f":"J4239+O4239","v":0}]
[null,null,null,null,null,null,null,null,null,null,null,null,null,null,null,{"$f":"J4240+O4240","v":0}]
[null,null,null,null,null,null,null,null,null,null,null,null,null,null,null,{"$f":"J4241+O4241","v":0}]
[null,null,null,null,null,null,null,null,null,null,null,null,null,null,null,{"$f":"J4242+O4242","v":0}]
[null,null,null,null,null,null,null,null,null,null,null,null,null,null,null,{"$f":"J4243+O4243","v":0}]
[null,null,null,null,null,null,null,null,null,null,null,null,null,null,null,{"$f":"J4244+O4244","v":0}]
[null,null,null,null,null,null,null,null,null,null,null,null,null,null,null,{"$f":"J4245+O4245","v":0}]
[null,null,null,null,null,null,null,null,null,null,null,null,null,null,null,{"$f":"J4246+O4246","v":0}]
[null,null,null,null,null,null,null,null,null,null,null,null,null,null,null,{"$f":"J4247+O4247","v":0}]
[null,null,null,null,null,null,null,null,null,null,null,null,null,null,null,{"$f":"J4248+O4248","v":0}]
[null,null,null,null,null,null,null,null,null,null,null,null,null,null,null,{"$f":"J4249+O4249","v":0}]
[null,null,null,null,null,null,null,null,null,null,null,null,null,null,null,{"$f":"J4250+O4250","v":0}]
[null,null,null,null,null,null,null,null,null,null,null,null,null,null,null,{"$f":"J4251+O4251","v":0}]
[null,null,null,null,null,null,null,null,null,null,null,null,null,null,null,{"$f":"J4252+O4252","v":0}]
[null,null,null,null,null,null,null,null,null,null,null,null,null,null,null,{"$f":"J4253+O4253","v":0}]
[null,null,null,null,null,null,null,null,null,null,null,null,null,null,null,{"$f":"J4254+O4254","v":0}]
[null,null,null,null,null,null,null,null,null,null,null,null,null,null,null,{"$f":"J4255+O4255","v":0}]
[null,null,null,null,null,null,null,null,null,null,null,null,null,null,null,{"$f":"J4256+O4256","v":0}]
[null,null,null,null,null,null,null,null,null,null,null,null,null,null,null,{"$f":"J4257+O4257","v":0}]
[null,null,null,null,null,null,null,null,null,null,null,null,null,null,null,{"$f":"J4258+O4258","v":0}]
[null,null,null,null,null,null,null,null,null,null,null,null,null,null,null,{"$f":"J4259+O4259","v":0}]
[null,null,null,null,null,null,null,null,null,null,null,null,null,null,null,{"$f":"J4260+O4260","v":0}]
[null,null,null,null,null,null,null,null,null,null,null,null,null,null,null,{"$f":"J4261+O4261","v":0}]
[null,null,null,null,null,null,null,null,null,null,null,null,null,null,null,{"$f":"J4262+O4262","v":0}]
[null,null,null,null,null,null,null,null,null,null,null,null,null,null,null,{"$f":"J4263+O4263","v":0}]
[null,null,null,null,null,null,null,null,null,null,null,null,null,null,null,{"$f":"J4264+O4264","v":0}]
[null,null,null,null,null,null,null,null,null,null,null,null,null,null,null,{"$f":"J4265+O4265","v":0}]
[null,null,null,null,null,null,null,null,null,null,null,null,null,null,null,{"$f":"J4266+O4266","v":0}]
[null,null,null,null,null,null,null,null,null,null,null,null,null,null,null,{"$f":"J4267+O4267","v":0}]
[null,null,null,null,null,null,null,null,null,null,null,null,null,null,null,{"$f":"J4268+O4268","v":0}]
[null,null,null,null,null,null,null,null,null,null,null,null,null,null,null,{"$f":"J4269+O4269","v":0}]
[null,null,null,null,null,null,null,null,null,null,null,null,null,null,null,{"$f":"J4270+O4270","v":0}]
[null,null,null,null,null,null,null,null,null,null,null,null,null,null,null,{"$f":"J4271+O4271","v":0}]
[null,null,null,null,null,null,null,null,null,null,null,null,null,null,null,{"$f":"J4272+O4272","v":0}]
[null,null,null,null,null,null,null,null,null,null,null,null,null,null,null,{"$f":"J4273+O4273","v":0}]
[null,null,null,null,null,null,null,null,null,null,null,null,null,null,null,{"$f":"J4274+O4274","v":0}]
[null,null,null,null,null,null,null,null,null,null,null,null,null,null,null,{"$f":"J4275+O4275","v":0}]
[null,null,null,null,null,null,null,null,null,null,null,null,null,null,null,{"$f":"J4276+O4276","v":0}]
[null,null,null,null,null,null,null,null,null,null,null,null,null,null,null,{"$f":"J4277+O4277","v":0}]
[null,null,null,null,null,null,null,null,null,null,null,null,null,null,null,{"$f":"J4278+O4278","v":0}]
[null,null,null,null,null,null,null,null,null,null,null,null,null,null,null,{"$f":"J4279+O4279","v":0}]
[null,null,null,null,null,null,null,null,null,null,null,null,null,null,null,{"$f":"J4280+O4280","v":0}]
[null,null,null,null,null,null,null,null,null,null,null,null,null,null,null,{"$f":"J4281+O4281","v":0}]
[null,null,null,null,null,null,null,null,null,null,null,null,null,null,null,{"$f":"J4282+O4282","v":0}]
[null,null,null,null,null,null,null,null,null,null,null,null,null,null,null,{"$f":"J4283+O4283","v":0}]
[null,null,null,null,null,null,null,null,null,null,null,null,null,null,null,{"$f":"J4284+O4284","v":0}]
[null,null,null,null,null,null,null,null,null,null,null,null,null,null,null,{"$f":"J4285+O4285","v":0}]
[null,null,null,null,null,null,null,null,null,null,null,null,null,null,null,{"$f":"J4286+O4286","v":0}]
[null,null,null,null,null,null,null,null,null,null,null,null,null,null,null,{"$f":"J4287+O4287","v":0}]
[null,null,null,null,null,null,null,null,null,null,null,null,null,null,null,{"$f":"J4288+O4288","v":0}]
[null,null,null,null,null,null,null,null,null,null,null,null,null,null,null,{"$f":"J4289+O4289","v":0}]
[null,null,null,null,null,null,null,null,null,null,null,null,null,null,null,{"$f":"J4290+O4290","v":0}]
[null,null,null,null,null,null,null,null,null,null,null,null,null,null,null,{"$f":"J4291+O4291","v":0}]
[null,null,null,null,null,null,null,null,null,null,null,null,null,null,null,{"$f":"J4292+O4292","v":0}]
[null,null,null,null,null,null,null,null,null,null,null,null,null,null,null,{"$f":"J4293+O4293","v":0}]
[null,null,null,null,null,null,null,null,null,null,null,null,null,null,null,{"$f":"J4294+O4294","v":0}]
[null,null,null,null,null,null,null,null,null,null,null,null,null,null,null,{"$f":"J4295+O4295","v":0}]
[null,null,null,null,null,null,null,null,null,null,null,null,null,null,null,{"$f":"J4296+O4296","v":0}]
[null,null,null,null,null,null,null,null,null,null,null,null,null,null,null,{"$f":"J4297+O4297","v":0}]
[null,null,null,null,null,null,null,null,null,null,null,null,null,null,null,{"$f":"J4298+O4298","v":0}]
[null,null,null,null,null,null,null,null,null,null,null,null,null,null,null,{"$f":"J4299+O4299","v":0}]
[null,null,null,null,null,null,null,null,null,null,null,null,null,null,null,{"$f":"J4300+O4300","v":0}]
[null,null,null,null,null,null,null,null,null,null,null,null,null,null,null,{"$f":"J4301+O4301","v":0}]
[null,null,null,null,null,null,null,null,null,null,null,null,null,null,null,{"$f":"J4302+O4302","v":0}]
[null,null,null,null,null,null,null,null,null,null,null,null,null,null,null,{"$f":"J4303+O4303","v":0}]
[null,null,null,null,null,null,null,null,null,null,null,null,null,null,null,{"$f":"J4304+O4304","v":0}]
[null,null,null,null,null,null,null,null,null,null,null,null,null,null,null,{"$f":"J4305+O4305","v":0}]
[null,null,null,null,null,null,null,null,null,null,null,null,null,null,null,{"$f":"J4306+O4306","v":0}]
[null,null,null,null,null,null,null,null,null,null,null,null,null,null,null,{"$f":"J4307+O4307","v":0}]
[null,null,null,null,null,null,null,null,null,null,null,null,null,null,null,{"$f":"J4308+O4308","v":0}]
[null,null,null,null,null,null,null,null,null,null,null,null,null,null,null,{"$f":"J4309+O4309","v":0}]
[null,null,null,null,null,null,null,null,null,null,null,null,null,null,null,{"$f":"J4310+O4310","v":0}]
[null,null,null,null,null,null,null,null,null,null,null,null,null,null,null,{"$f":"J4311+O4311","v":0}]
[null,null,null,null,null,null,null,null,null,null,null,null,null,null,null,{"$f":"J4312+O4312","v":0}]
[null,null,null,null,null,null,null,null,null,null,null,null,null,null,null,{"$f":"J4313+O4313","v":0}]
[null,null,null,null,null,null,null,null,null,null,null,null,null,null,null,{"$f":"J4314+O4314","v":0}]
[null,null,null,null,null,null,null,null,null,null,null,null,null,null,null,{"$f":"J4315+O4315","v":0}]
[null,null,null,null,null,null,null,null,null,null,null,null,null,null,null,{"$f":"J4316+O4316","v":0}]
[null,null,null,null,null,null,null,null,null,null,null,null,null,null,null,{"$f":"J4317+O4317","v":0}]
[null,null,null,null,null,null,null,null,null,null,null,null,null,null,null,{"$f":"J4318+O4318","v":0}]
[null,null,null,null,null,null,null,null,null,null,null,null,null,null,null,{"$f":"J4319+O4319","v":0}]
[null,null,null,null,null,null,null,null,null,null,null,null,null,null,null,{"$f":"J4320+O4320","v":0}]
[null,null,null,null,null,null,null,null,null,null,null,null,null,null,null,{"$f":"J4321+O4321","v":0}]
[null,null,null,null,null,null,null,null,null,null,null,null,null,null,null,{"$f":"J4322+O4322","v":0}]
[null,null,null,null,null,null,null,null,null,null,null,null,null,null,null,{"$f":"J4323+O4323","v":0}]
[null,null,null,null,null,null,null,null,null,null,null,null,null,null,null,{"$f":"J4324+O4324","v":0}]
[null,null,null,null,null,null,null,null,null,null,null,null,null,null,null,{"$f":"J4325+O4325","v":0}]
[null,null,null,null,null,null,null,null,null,null,null,null,null,null,null,{"$f":"J4326+O4326","v":0}]
[null,null,null,null,null,null,null,null,null,null,null,null,null,null,null,{"$f":"J4327+O4327","v":0}]
[null,null,null,null,null,null,null,null,null,null,null,null,null,null,null,{"$f":"J4328+O4328","v":0}]
[null,null,null,null,null,null,null,null,null,null,null,null,null,null,null,{"$f":"J4329+O4329","v":0}]
[null,null,null,null,null,null,null,null,null,null,null,null,null,null,null,{"$f":"J4330+O4330","v":0}]
[null,null,null,null,null,null,null,null,null,null,null,null,null,null,null,{"$f":"J4331+O4331","v":0}]
[null,null,null,null,null,null,null,null,null,null,null,null,null,null,null,{"$f":"J4332+O4332","v":0}]
[null,null,null,null,null,null,null,null,null,null,null,null,null,null,null,{"$f":"J4333+O4333","v":0}]
[null,null,null,null,null,null,null,null,null,null,null,null,null,null,null,{"$f":"J4334+O4334","v":0}]
[null,null,null,null,null,null,null,null,null,null,null,null,null,null,null,{"$f":"J4335+O4335","v":0}]
[null,null,null,null,null,null,null,null,null,null,null,null,null,null,null,{"$f":"J4336+O4336","v":0}]
[null,null,null,null,null,null,null,null,null,null,null,null,null,null,null,{"$f":"J4337+O4337","v":0}]
[null,null,null,null,null,null,null,null,null,null,null,null,null,null,null,{"$f":"J4338+O4338","v":0}]
[null,null,null,null,null,null,null,null,null,null,null,null,null,null,null,{"$f":"J4339+O4339","v":0}]
[null,null,null,null,null,null,null,null,null,null,null,null,null,null,null,{"$f":"J4340+O4340","v":0}]
[null,null,null,null,null,null,null,null,null,null,null,null,null,null,null,{"$f":"J4341+O4341","v":0}]
[null,null,null,null,null,null,null,null,null,null,null,null,null,null,null,{"$f":"J4342+O4342","v":0}]
[null,null,null,null,null,null,null,null,null,null,null,null,null,null,null,{"$f":"J4343+O4343","v":0}]
[null,null,null,null,null,null,null,null,null,null,null,null,null,null,null,{"$f":"J4344+O4344","v":0}]
[null,null,null,null,null,null,null,null,null,null,null,null,null,null,null,{"$f":"J4345+O4345","v":0}]
[null,null,null,null,null,null,null,null,null,null,null,null,null,null,null,{"$f":"J4346+O4346","v":0}]
[null,null,null,null,null,null,null,null,null,null,null,null,null,null,null,{"$f":"J4347+O4347","v":0}]
[null,null,null,null,null,null,null,null,null,null,null,null,null,null,null,{"$f":"J4348+O4348","v":0}]
[null,null,null,null,null,null,null,null,null,null,null,null,null,null,null,{"$f":"J4349+O4349","v":0}]
[null,null,null,null,null,null,null,null,null,null,null,null,null,null,null,{"$f":"J4350+O4350","v":0}]
[null,null,null,null,null,null,null,null,null,null,null,null,null,null,null,{"$f":"J4351+O4351","v":0}]
[null,null,null,null,null,null,null,null,null,null,null,null,null,null,null,{"$f":"J4352+O4352","v":0}]
[null,null,null,null,null,null,null,null,null,null,null,null,null,null,null,{"$f":"J4353+O4353","v":0}]
[null,null,null,null,null,null,null,null,null,null,null,null,null,null,null,{"$f":"J4354+O4354","v":0}]
[null,null,null,null,null,null,null,null,null,null,null,null,null,null,null,{"$f":"J4355+O4355","v":0}]
[null,null,null,null,null,null,null,null,null,null,null,null,null,null,null,{"$f":"J4356+O4356","v":0}]
[null,null,null,null,null,null,null,null,null,null,null,null,null,null,null,{"$f":"J4357+O4357","v":0}]
[null,null,null,null,null,null,null,null,null,null,null,null,null,null,null,{"$f":"J4358+O4358","v":0}]
[null,null,null,null,null,null,null,null,null,null,null,null,null,null,null,{"$f":"J4359+O4359","v":0}]
[null,null,null,null,null,null,null,null,null,null,null,null,null,null,null,{"$f":"J4360+O4360","v":0}]
[null,null,null,null,null,null,null,null,null,null,null,null,null,null,null,{"$f":"J4361+O4361","v":0}]
[null,null,null,null,null,null,null,null,null,null,null,null,null,null,null,{"$f":"J4362+O4362","v":0}]
[null,null,null,null,null,null,null,null,null,null,null,null,null,null,null,{"$f":"J4363+O4363","v":0}]
[null,null,null,null,null,null,null,null,null,null,null,null,null,null,null,{"$f":"J4364+O4364","v":0}]
[null,null,null,null,null,null,null,null,null,null,null,null,null,null,null,{"$f":"J4365+O4365","v":0}]
[null,null,null,null,null,null,null,null,null,null,null,null,null,null,null,{"$f":"J4366+O4366","v":0}]
[null,null,null,null,null,null,null,null,null,null,null,null,null,null,null,{"$f":"J4367+O4367","v":0}]
[null,null,null,null,null,null,null,null,null,null,null,null,null,null,null,{"$f":"J4368+O4368","v":0}]
[null,null,null,null,null,null,null,null,null,null,null,null,null,null,null,{"$f":"J4369+O4369","v":0}]
[null,null,null,null,null,null,null,null,null,null,null,null,null,null,null,{"$f":"J4370+O4370","v":0}]
[null,null,null,null,null,null,null,null,null,null,null,null,null,null,null,{"$f":"J4371+O4371","v":0}]
[null,null,null,null,null,null,null,null,null,null,null,null,null,null,null,{"$f":"J4372+O4372","v":0}]
[null,null,null,null,null,null,null,null,null,null,null,null,null,null,null,{"$f":"J4373+O4373","v":0}]
[null,null,null,null,null,null,null,null,null,null,null,null,null,null,null,{"$f":"J4374+O4374","v":0}]
[null,null,null,null,null,null,null,null,null,null,null,null,null,null,null,{"$f":"J4375+O4375","v":0}]
[null,null,null,null,null,null,null,null,null,null,null,null,null,null,null,{"$f":"J4376+O4376","v":0}]
[null,null,null,null,null,null,null,null,null,null,null,null,null,null,null,{"$f":"J4377+O4377","v":0}]
[null,null,null,null,null,null,null,null,null,null,null,null,null,null,null,{"$f":"J4378+O4378","v":0}]
[null,null,null,null,null,null,null,null,null,null,null,null,null,null,null,{"$f":"J4379+O4379","v":0}]
[null,null,null,null,null,null,null,null,null,null,null,null,null,null,null,{"$f":"J4380+O4380","v":0}]
[null,null,null,null,null,null,null,null,null,null,null,null,null,null,null,{"$f":"J4381+O4381","v":0}]
[null,null,null,null,null,null,null,null,null,null,null,null,null,null,null,{"$f":"J4382+O4382","v":0}]
[null,null,null,null,null,null,null,null,null,null,null,null,null,null,null,{"$f":"J4383+O4383","v":0}]
[null,null,null,null,null,null,null,null,null,null,null,null,null,null,null,{"$f":"J4384+O4384","v":0}]
[null,null,null,null,null,null,null,null,null,null,null,null,null,null,null,{"$f":"J4385+O4385","v":0}]
[null,null,null,null,null,null,null,null,null,null,null,null,null,null,null,{"$f":"J4386+O4386","v":0}]
[null,null,null,null,null,null,null,null,null,null,null,null,null,null,null,{"$f":"J4387+O4387","v":0}]
[null,null,null,null,null,null,null,null,null,null,null,null,null,null,null,{"$f":"J4388+O4388","v":0}]
[null,null,null,null,null,null,null,null,null,null,null,null,null,null,null,{"$f":"J4389+O4389","v":0}]
[null,null,null,null,null,null,null,null,null,null,null,null,null,null,null,{"$f":"J4390+O4390","v":0}]
[null,null,null,null,null,null,null,null,null,null,null,null,null,null,null,{"$f":"J4391+O4391","v":0}]
[null,null,null,null,null,null,null,null,null,null,null,null,null,null,null,{"$f":"J4392+O4392","v":0}]
[null,null,null,null,null,null,null,null,null,null,null,null,null,null,null,{"$f":"J4393+O4393","v":0}]
[null,null,null,null,null,null,null,null,null,null,null,null,null,null,null,{"$f":"J4394+O4394","v":0}]
[null,null,null,null,null,null,null,null,null,null,null,null,null,null,null,{"$f":"J4395+O4395","v":0}]
[null,null,null,null,null,null,null,null,null,null,null,null,null,null,null,{"$f":"J4396+O4396","v":0}]
[null,null,null,null,null,null,null,null,null,null,null,null,null,null,null,{"$f":"J4397+O4397","v":0}]
[null,null,null,null,null,null,null,null,null,null,null,null,null,null,null,{"$f":"J4398+O4398","v":0}]
[null,null,null,null,null,null,null,null,null,null,null,null,null,null,null,{"$f":"J4399+O4399","v":0}]
[null,null,null,null,null,null,null,null,null,null,null,null,null,null,null,{"$f":"J4400+O4400","v":0}]
[null,null,null,null,null,null,null,null,null,null,null,null,null,null,null,{"$f":"J4401+O4401","v":0}]
[null,null,null,null,null,null,null,null,null,null,null,null,null,null,null,{"$f":"J4402+O4402","v":0}]
[null,null,null,null,null,null,null,null,null,null,null,null,null,null,null,{"$f":"J4403+O4403","v":0}]
[null,null,null,null,null,null,null,null,null,null,null,null,null,null,null,{"$f":"J4404+O4404","v":0}]
[null,null,null,null,null,null,null,null,null,null,null,null,null,null,null,{"$f":"J4405+O4405","v":0}]
[null,null,null,null,null,null,null,null,null,null,null,null,null,null,null,{"$f":"J4406+O4406","v":0}]
[null,null,null,null,null,null,null,null,null,null,null,null,null,null,null,{"$f":"J4407+O4407","v":0}]
[null,null,null,null,null,null,null,null,null,null,null,null,null,null,null,{"$f":"J4408+O4408","v":0}]
[null,null,null,null,null,null,null,null,null,null,null,null,null,null,null,{"$f":"J4409+O4409","v":0}]
[null,null,null,null,null,null,null,null,null,null,null,null,null,null,null,{"$f":"J4410+O4410","v":0}]
[null,null,null,null,null,null,null,null,null,null,null,null,null,null,null,{"$f":"J4411+O4411","v":0}]
[null,null,null,null,null,null,null,null,null,null,null,null,null,null,null,{"$f":"J4412+O4412","v":0}]
[null,null,null,null,null,null,null,null,null,null,null,null,null,null,null,{"$f":"J4413+O4413","v":0}]
[null,null,null,null,null,null,null,null,null,null,null,null,null,null,null,{"$f":"J4414+O4414","v":0}]
[null,null,null,null,null,null,null,null,null,null,null,null,null,null,null,{"$f":"J4415+O4415","v":0}]
[null,null,null,null,null,null,null,null,null,null,null,null,null,null,null,{"$f":"J4416+O4416","v":0}]
[null,null,null,null,null,null,null,null,null,null,null,null,null,null,null,{"$f":"J4417+O4417","v":0}]
[null,null,null,null,null,null,null,null,null,null,null,null,null,null,null,{"$f":"J4418+O4418","v":0}]
[null,null,null,null,null,null,null,null,null,null,null,null,null,null,null,{"$f":"J4419+O4419","v":0}]
[null,null,null,null,null,null,null,null,null,null,null,null,null,null,null,{"$f":"J4420+O4420","v":0}]
[null,null,null,null,null,null,null,null,null,null,null,null,null,null,null,{"$f":"J4421+O4421","v":0}]
[null,null,null,null,null,null,null,null,null,null,null,null,null,null,null,{"$f":"J4422+O4422","v":0}]
[null,null,null,null,null,null,null,null,null,null,null,null,null,null,null,{"$f":"J4423+O4423","v":0}]
[null,null,null,null,null,null,null,null,null,null,null,null,null,null,null,{"$f":"J4424+O4424","v":0}]
[null,null,null,null,null,null,null,null,null,null,null,null,null,null,null,{"$f":"J4425+O4425","v":0}]
[null,null,null,null,null,null,null,null,null,null,null,null,null,null,null,{"$f":"J4426+O4426","v":0}]
[null,null,null,null,null,null,null,null,null,null,null,null,null,null,null,{"$f":"J4427+O4427","v":0}]
[null,null,null,null,null,null,null,null,null,null,null,null,null,null,null,{"$f":"J4428+O4428","v":0}]
[null,null,null,null,null,null,null,null,null,null,null,null,null,null,null,{"$f":"J4429+O4429","v":0}]
[null,null,null,null,null,null,null,null,null,null,null,null,null,null,null,{"$f":"J4430+O4430","v":0}]
[null,null,null,null,null,null,null,null,null,null,null,null,null,null,null,{"$f":"J4431+O4431","v":0}]
[null,null,null,null,null,null,null,null,null,null,null,null,null,null,null,{"$f":"J4432+O4432","v":0}]
[null,null,null,null,null,null,null,null,null,null,null,null,null,null,null,{"$f":"J4433+O4433","v":0}]
[null,null,null,null,null,null,null,null,null,null,null,null,null,null,null,{"$f":"J4434+O4434","v":0}]
[null,null,null,null,null,null,null,null,null,null,null,null,null,null,null,{"$f":"J4435+O4435","v":0}]
[null,null,null,null,null,null,null,null,null,null,null,null,null,null,null,{"$f":"J4436+O4436","v":0}]
[null,null,null,null,null,null,null,null,null,null,null,null,null,null,null,{"$f":"J4437+O4437","v":0}]
[null,null,null,null,null,null,null,null,null,null,null,null,null,null,null,{"$f":"J4438+O4438","v":0}]
[null,null,null,null,null,null,null,null,null,null,null,null,null,null,null,{"$f":"J4439+O4439","v":0}]
[null,null,null,null,null,null,null,null,null,null,null,null,null,null,null,{"$f":"J4440+O4440","v":0}]
[null,null,null,null,null,null,null,null,null,null,null,null,null,null,null,{"$f":"J4441+O4441","v":0}]
[null,null,null,null,null,null,null,null,null,null,null,null,null,null,null,{"$f":"J4442+O4442","v":0}]
[null,null,null,null,null,null,null,null,null,null,null,null,null,null,null,{"$f":"J4443+O4443","v":0}]
[null,null,null,null,null,null,null,null,null,null,null,null,null,null,null,{"$f":"J4444+O4444","v":0}]
[null,null,null,null,null,null,null,null,null,null,null,null,null,null,null,{"$f":"J4445+O4445","v":0}]
[null,null,null,null,null,null,null,null,null,null,null,null,null,null,null,{"$f":"J4446+O4446","v":0}]
[null,null,null,null,null,null,null,null,null,null,null,null,null,null,null,{"$f":"J4447+O4447","v":0}]
[null,null,null,null,null,null,null,null,null,null,null,null,null,null,null,{"$f":"J4448+O4448","v":0}]
[null,null,null,null,null,null,null,null,null,null,null,null,null,null,null,{"$f":"J4449+O4449","v":0}]
[null,null,null,null,null,null,null,null,null,null,null,null,null,null,null,{"$f":"J4450+O4450","v":0}]
[null,null,null,null,null,null,null,null,null,null,null,null,null,null,null,{"$f":"J4451+O4451","v":0}]
[null,null,null,null,null,null,null,null,null,null,null,null,null,null,null,{"$f":"J4452+O4452","v":0}]
[null,null,null,null,null,null,null,null,null,null,null,null,null,null,null,{"$f":"J4453+O4453","v":0}]
[null,null,null,null,null,null,null,null,null,null,null,null,null,null,null,{"$f":"J4454+O4454","v":0}]
[null,null,null,null,null,null,null,null,null,null,null,null,null,null,null,{"$f":"J4455+O4455","v":0}]
[null,null,null,null,null,null,null,null,null,null,null,null,null,null,null,{"$f":"J4456+O4456","v":0}]
[null,null,null,null,null,null,null,null,null,null,null,null,null,null,null,{"$f":"J4457+O4457","v":0}]
[null,null,null,null,null,null,null,null,null,null,null,null,null,null,null,{"$f":"J4458+O4458","v":0}]
[null,null,null,null,null,null,null,null,null,null,null,null,null,null,null,{"$f":"J4459+O4459","v":0}]
[null,null,null,null,null,null,null,null,null,null,null,null,null,null,null,{"$f":"J4460+O4460","v":0}]
[null,null,null,null,null,null,null,null,null,null,null,null,null,null,null,{"$f":"J4461+O4461","v":0}]
[null,null,null,null,null,null,null,null,null,null,null,null,null,null,null,{"$f":"J4462+O4462","v":0}]
[null,null,null,null,null,null,null,null,null,null,null,null,null,null,null,{"$f":"J4463+O4463","v":0}]
[null,null,null,null,null,null,null,null,null,null,null,null,null,null,null,{"$f":"J4464+O4464","v":0}]
[null,null,null,null,null,null,null,null,null,null,null,null,null,null,null,{"$f":"J4465+O4465","v":0}]
[null,null,null,null,null,null,null,null,null,null,null,null,null,null,null,{"$f":"J4466+O4466","v":0}]
[null,null,null,null,null,null,null,null,null,null,null,null,null,null,null,{"$f":"J4467+O4467","v":0}]
[null,null,null,null,null,null,null,null,null,null,null,null,null,null,null,{"$f":"J4468+O4468","v":0}]
[null,null,null,null,null,null,null,null,null,null,null,null,null,null,null,{"$f":"J4469+O4469","v":0}]
[null,null,null,null,null,null,null,null,null,null,null,null,null,null,null,{"$f":"J4470+O4470","v":0}]
[null,null,null,null,null,null,null,null,null,null,null,null,null,null,null,{"$f":"J4471+O4471","v":0}]
[null,null,null,null,null,null,null,null,null,null,null,null,null,null,null,{"$f":"J4472+O4472","v":0}]
[null,null,null,null,null,null,null,null,null,null,null,null,null,null,null,{"$f":"J4473+O4473","v":0}]
[null,null,null,null,null,null,null,null,null,null,null,null,null,null,null,{"$f":"J4474+O4474","v":0}]
[null,null,null,null,null,null,null,null,null,null,null,null,null,null,null,{"$f":"J4475+O4475","v":0}]
[null,null,null,null,null,null,null,null,null,null,null,null,null,null,null,{"$f":"J4476+O4476","v":0}]
[null,null,null,null,null,null,null,null,null,null,null,null,null,null,null,{"$f":"J4477+O4477","v":0}]
[null,null,null,null,null,null,null,null,null,null,null,null,null,null,null,{"$f":"J4478+O4478","v":0}]
[null,null,null,null,null,null,null,null,null,null,null,null,null,null,null,{"$f":"J4479+O4479","v":0}]
[null,null,null,null,null,null,null,null,null,null,null,null,null,null,null,{"$f":"J4480+O4480","v":0}]
[null,null,null,null,null,null,null,null,null,null,null,null,null,null,null,{"$f":"J4481+O4481","v":0}]
[null,null,null,null,null,null,null,null,null,null,null,null,null,null,null,{"$f":"J4482+O4482","v":0}]
[null,null,null,null,null,null,null,null,null,null,null,null,null,null,null,{"$f":"J4483+O4483","v":0}]
[null,null,null,null,null,null,null,null,null,null,null,null,null,null,null,{"$f":"J4484+O4484","v":0}]
[null,null,null,null,null,null,null,null,null,null,null,null,null,null,null,{"$f":"J4485+O4485","v":0}]
[null,null,null,null,null,null,null,null,null,null,null,null,null,null,null,{"$f":"J4486+O4486","v":0}]
[null,null,null,null,null,null,null,null,null,null,null,null,null,null,null,{"$f":"J4487+O4487","v":0}]
[null,null,null,null,null,null,null,null,null,null,null,null,null,null,null,{"$f":"J4488+O4488","v":0}]
[null,null,null,null,null,null,null,null,null,null,null,null,null,null,null,{"$f":"J4489+O4489","v":0}]
[null,null,null,null,null,null,null,null,null,null,null,null,null,null,null,{"$f":"J4490+O4490","v":0}]
[null,null,null,null,null,null,null,null,null,null,null,null,null,null,null,{"$f":"J4491+O4491","v":0}]
[null,null,null,null,null,null,null,null,null,null,null,null,null,null,null,{"$f":"J4492+O4492","v":0}]
[null,null,null,null,null,null,null,null,null,null,null,null,null,null,null,{"$f":"J4493+O4493","v":0}]
[null,null,null,null,null,null,null,null,null,null,null,null,null,null,null,{"$f":"J4494+O4494","v":0}]
[null,null,null,null,null,null,null,null,null,null,null,null,null,null,null,{"$f":"J4495+O4495","v":0}]
[null,null,null,null,null,null,null,null,null,null,null,null,null,null,null,{"$f":"J4496+O4496","v":0}]
[null,null,null,null,null,null,null,null,null,null,null,null,null,null,null,{"$f":"J4497+O4497","v":0}]
[null,null,null,null,null,null,null,null,null,null,null,null,null,null,null,{"$f":"J4498+O4498","v":0}]
[null,null,null,null,null,null,null,null,null,null,null,null,null,null,null,{"$f":"J4499+O4499","v":0}]
[null,null,null,null,null,null,null,null,null,null,null,null,null,null,null,{"$f":"J4500+O4500","v":0}]
[null,null,null,null,null,null,null,null,null,null,null,null,null,null,null,{"$f":"J4501+O4501","v":0}]
[null,null,null,null,null,null,null,null,null,null,null,null,null,null,null,{"$f":"J4502+O4502","v":0}]
[null,null,null,null,null,null,null,null,null,null,null,null,null,null,null,{"$f":"J4503+O4503","v":0}]
[null,null,null,null,null,null,null,null,null,null,null,null,null,null,null,{"$f":"J4504+O4504","v":0}]
[null,null,null,null,null,null,null,null,null,null,null,null,null,null,null,{"$f":"J4505+O4505","v":0}]
[null,null,null,null,null,null,null,null,null,null,null,null,null,null,null,{"$f":"J4506+O4506","v":0}]
[null,null,null,null,null,null,null,null,null,null,null,null,null,null,null,{"$f":"J4507+O4507","v":0}]
[null,null,null,null,null,null,null,null,null,null,null,null,null,null,null,{"$f":"J4508+O4508","v":0}]
[null,null,null,null,null,null,null,null,null,null,null,null,null,null,null,{"$f":"J4509+O4509","v":0}]
[null,null,null,null,null,null,null,null,null,null,null,null,null,null,null,{"$f":"J4510+O4510","v":0}]
[null,null,null,null,null,null,null,null,null,null,null,null,null,null,null,{"$f":"J4511+O4511","v":0}]
[null,null,null,null,null,null,null,null,null,null,null,null,null,null,null,{"$f":"J4512+O4512","v":0}]
[null,null,null,null,null,null,null,null,null,null,null,null,null,null,null,{"$f":"J4513+O4513","v":0}]
[null,null,null,null,null,null,null,null,null,null,null,null,null,null,null,{"$f":"J4514+O4514","v":0}]
[null,null,null,null,null,null,null,null,null,null,null,null,null,null,null,{"$f":"J4515+O4515","v":0}]
[null,null,null,null,null,null,null,null,null,null,null,null,null,null,null,{"$f":"J4516+O4516","v":0}]
[null,null,null,null,null,null,null,null,null,null,null,null,null,null,null,{"$f":"J4517+O4517","v":0}]
[null,null,null,null,null,null,null,null,null,null,null,null,null,null,null,{"$f":"J4518+O4518","v":0}]
[null,null,null,null,null,null,null,null,null,null,null,null,null,null,null,{"$f":"J4519+O4519","v":0}]
[null,null,null,null,null,null,null,null,null,null,null,null,null,null,null,{"$f":"J4520+O4520","v":0}]
[null,null,null,null,null,null,null,null,null,null,null,null,null,null,null,{"$f":"J4521+O4521","v":0}]
[null,null,null,null,null,null,null,null,null,null,null,null,null,null,null,{"$f":"J4522+O4522","v":0}]
[null,null,null,null,null,null,null,null,null,null,null,null,null,null,null,{"$f":"J4523+O4523","v":0}]
[null,null,null,null,null,null,null,null,null,null,null,null,null,null,null,{"$f":"J4524+O4524","v":0}]
[null,null,null,null,null,null,null,null,null,null,null,null,null,null,null,{"$f":"J4525+O4525","v":0}]
[null,null,null,null,null,null,null,null,null,null,null,null,null,null,null,{"$f":"J4526+O4526","v":0}]
[null,null,null,null,null,null,null,null,null,null,null,null,null,null,null,{"$f":"J4527+O4527","v":0}]
[null,null,null,null,null,null,null,null,null,null,null,null,null,null,null,{"$f":"J4528+O4528","v":0}]
[null,null,null,null,null,null,null,null,null,null,null,null,null,null,null,{"$f":"J4529+O4529","v":0}]
[null,null,null,null,null,null,null,null,null,null,null,null,null,null,null,{"$f":"J4530+O4530","v":0}]
[null,null,null,null,null,null,null,null,null,null,null,null,null,null,null,{"$f":"J4531+O4531","v":0}]
[null,null,null,null,null,null,null,null,null,null,null,null,null,null,null,{"$f":"J4532+O4532","v":0}]
[null,null,null,null,null,null,null,null,null,null,null,null,null,null,null,{"$f":"J4533+O4533","v":0}]
[null,null,null,null,null,null,null,null,null,null,null,null,null,null,null,{"$f":"J4534+O4534","v":0}]
[null,null,null,null,null,null,null,null,null,null,null,null,null,null,null,{"$f":"J4535+O4535","v":0}]
[null,null,null,null,null,null,null,null,null,null,null,null,null,null,null,{"$f":"J4536+O4536","v":0}]
[null,null,null,null,null,null,null,null,null,null,null,null,null,null,null,{"$f":"J4537+O4537","v":0}]
[null,null,null,null,null,null,null,null,null,null,null,null,null,null,null,{"$f":"J4538+O4538","v":0}]
[null,null,null,null,null,null,null,null,null,null,null,null,null,null,null,{"$f":"J4539+O4539","v":0}]
[null,null,null,null,null,null,null,null,null,null,null,null,null,null,null,{"$f":"J4540+O4540","v":0}]
[null,null,null,null,null,null,null,null,null,null,null,null,null,null,null,{"$f":"J4541+O4541","v":0}]
[null,null,null,null,null,null,null,null,null,null,null,null,null,null,null,{"$f":"J4542+O4542","v":0}]
[null,null,null,null,null,null,null,null,null,null,null,null,null,null,null,{"$f":"J4543+O4543","v":0}]
[null,null,null,null,null,null,null,null,null,null,null,null,null,null,null,{"$f":"J4544+O4544","v":0}]
[null,null,null,null,null,null,null,null,null,null,null,null,null,null,null,{"$f":"J4545+O4545","v":0}]
[null,null,null,null,null,null,null,null,null,null,null,null,null,null,null,{"$f":"J4546+O4546","v":0}]
[null,null,null,null,null,null,null,null,null,null,null,null,null,null,null,{"$f":"J4547+O4547","v":0}]
[null,null,null,null,null,null,null,null,null,null,null,null,null,null,null,{"$f":"J4548+O4548","v":0}]
[null,null,null,null,null,null,null,null,null,null,null,null,null,null,null,{"$f":"J4549+O4549","v":0}]
[null,null,null,null,null,null,null,null,null,null,null,null,null,null,null,{"$f":"J4550+O4550","v":0}]
[null,null,null,null,null,null,null,null,null,null,null,null,null,null,null,{"$f":"J4551+O4551","v":0}]
[null,null,null,null,null,null,null,null,null,null,null,null,null,null,null,{"$f":"J4552+O4552","v":0}]
[null,null,null,null,null,null,null,null,null,null,null,null,null,null,null,{"$f":"J4553+O4553","v":0}]
[null,null,null,null,null,null,null,null,null,null,null,null,null,null,null,{"$f":"J4554+O4554","v":0}]
[null,null,null,null,null,null,null,null,null,null,null,null,null,null,null,{"$f":"J4555+O4555","v":0}]
[null,null,null,null,null,null,null,null,null,null,null,null,null,null,null,{"$f":"J4556+O4556","v":0}]
[null,null,null,null,null,null,null,null,null,null,null,null,null,null,null,{"$f":"J4557+O4557","v":0}]
[null,null,null,null,null,null,null,null,null,null,null,null,null,null,null,{"$f":"J4558+O4558","v":0}]
[null,null,null,null,null,null,null,null,null,null,null,null,null,null,null,{"$f":"J4559+O4559","v":0}]
[null,null,null,null,null,null,null,null,null,null,null,null,null,null,null,{"$f":"J4560+O4560","v":0}]
[null,null,null,null,null,null,null,null,null,null,null,null,null,null,null,{"$f":"J4561+O4561","v":0}]
[null,null,null,null,null,null,null,null,null,null,null,null,null,null,null,{"$f":"J4562+O4562","v":0}]
[null,null,null,null,null,null,null,null,null,null,null,null,null,null,null,{"$f":"J4563+O4563","v":0}]
[null,null,null,null,null,null,null,null,null,null,null,null,null,null,null,{"$f":"J4564+O4564","v":0}]
[null,null,null,null,null,null,null,null,null,null,null,null,null,null,null,{"$f":"J4565+O4565","v":0}]
[null,null,null,null,null,null,null,null,null,null,null,null,null,null,null,{"$f":"J4566+O4566","v":0}]
[null,null,null,null,null,null,null,null,null,null,null,null,null,null,null,{"$f":"J4567+O4567","v":0}]
[null,null,null,null,null,null,null,null,null,null,null,null,null,null,null,{"$f":"J4568+O4568","v":0}]
[null,null,null,null,null,null,null,null,null,null,null,null,null,null,null,{"$f":"J4569+O4569","v":0}]
[null,null,null,null,null,null,null,null,null,null,null,null,null,null,null,{"$f":"J4570+O4570","v":0}]
[null,null,null,null,null,null,null,null,null,null,null,null,null,null,null,{"$f":"J4571+O4571","v":0}]
[null,null,null,null,null,null,null,null,null,null,null,null,null,null,null,{"$f":"J4572+O4572","v":0}]
[null,null,null,null,null,null,null,null,null,null,null,null,null,null,null,{"$f":"J4573+O4573","v":0}]
[null,null,null,null,null,null,null,null,null,null,null,null,null,null,null,{"$f":"J4574+O4574","v":0}]
[null,null,null,null,null,null,null,null,null,null,null,null,null,null,null,{"$f":"J4575+O4575","v":0}]
[null,null,null,null,null,null,null,null,null,null,null,null,null,null,null,{"$f":"J4576+O4576","v":0}]
[null,null,null,null,null,null,null,null,null,null,null,null,null,null,null,{"$f":"J4577+O4577","v":0}]
[null,null,null,null,null,null,null,null,null,null,null,null,null,null,null,{"$f":"J4578+O4578","v":0}]
[null,null,null,null,null,null,null,null,null,null,null,null,null,null,null,{"$f":"J4579+O4579","v":0}]
[null,null,null,null,null,null,null,null,null,null,null,null,null,null,null,{"$f":"J4580+O4580","v":0}]
[null,null,null,null,null,null,null,null,null,null,null,null,null,null,null,{"$f":"J4581+O4581","v":0}]
[null,null,null,null,null,null,null,null,null,null,null,null,null,null,null,{"$f":"J4582+O4582","v":0}]
[null,null,null,null,null,null,null,null,null,null,null,null,null,null,null,{"$f":"J4583+O4583","v":0}]
[null,null,null,null,null,null,null,null,null,null,null,null,null,null,null,{"$f":"J4584+O4584","v":0}]
[null,null,null,null,null,null,null,null,null,null,null,null,null,null,null,{"$f":"J4585+O4585","v":0}]
[null,null,null,null,null,null,null,null,null,null,null,null,null,null,null,{"$f":"J4586+O4586","v":0}]
[null,null,null,null,null,null,null,null,null,null,null,null,null,null,null,{"$f":"J4587+O4587","v":0}]
[null,null,null,null,null,null,null,null,null,null,null,null,null,null,null,{"$f":"J4588+O4588","v":0}]
[null,null,null,null,null,null,null,null,null,null,null,null,null,null,null,{"$f":"J4589+O4589","v":0}]
[null,null,null,null,null,null,null,null,null,null,null,null,null,null,null,{"$f":"J4590+O4590","v":0}]
[null,null,null,null,null,null,null,null,null,null,null,null,null,null,null,{"$f":"J4591+O4591","v":0}]
[null,null,null,null,null,null,null,null,null,null,null,null,null,null,null,{"$f":"J4592+O4592","v":0}]
[null,null,null,null,null,null,null,null,null,null,null,null,null,null,null,{"$f":"J4593+O4593","v":0}]
[null,null,null,null,null,null,null,null,null,null,null,null,null,null,null,{"$f":"J4594+O4594","v":0}]
[null,null,null,null,null,null,null,null,null,null,null,null,null,null,null,{"$f":"J4595+O4595","v":0}]
[null,null,null,null,null,null,null,null,null,null,null,null,null,null,null,{"$f":"J4596+O4596","v":0}]
[null,null,null,null,null,null,null,null,null,null,null,null,null,null,null,{"$f":"J4597+O4597","v":0}]
[null,null,null,null,null,null,null,null,null,null,null,null,null,null,null,{"$f":"J4598+O4598","v":0}]
[null,null,null,null,null,null,null,null,null,null,null,null,null,null,null,{"$f":"J4599+O4599","v":0}]
[null,null,null,null,null,null,null,null,null,null,null,null,null,null,null,{"$f":"J4600+O4600","v":0}]
[null,null,null,null,null,null,null,null,null,null,null,null,null,null,null,{"$f":"J4601+O4601","v":0}]
[null,null,null,null,null,null,null,null,null,null,null,null,null,null,null,{"$f":"J4602+O4602","v":0}]
[null,null,null,null,null,null,null,null,null,null,null,null,null,null,null,{"$f":"J4603+O4603","v":0}]
[null,null,null,null,null,null,null,null,null,null,null,null,null,null,null,{"$f":"J4604+O4604","v":0}]
[null,null,null,null,null,null,null,null,null,null,null,null,null,null,null,{"$f":"J4605+O4605","v":0}]
[null,null,null,null,null,null,null,null,null,null,null,null,null,null,null,{"$f":"J4606+O4606","v":0}]
[null,null,null,null,null,null,null,null,null,null,null,null,null,null,null,{"$f":"J4607+O4607","v":0}]
[null,null,null,null,null,null,null,null,null,null,null,null,null,null,null,{"$f":"J4608+O4608","v":0}]
[null,null,null,null,null,null,null,null,null,null,null,null,null,null,null,{"$f":"J4609+O4609","v":0}]
[null,null,null,null,null,null,null,null,null,null,null,null,null,null,null,{"$f":"J4610+O4610","v":0}]
[null,null,null,null,null,null,null,null,null,null,null,null,null,null,null,{"$f":"J4611+O4611","v":0}]
[null,null,null,null,null,null,null,null,null,null,null,null,null,null,null,{"$f":"J4612+O4612","v":0}]
[null,null,null,null,null,null,null,null,null,null,null,null,null,null,null,{"$f":"J4613+O4613","v":0}]
[null,null,null,null,null,null,null,null,null,null,null,null,null,null,null,{"$f":"J4614+O4614","v":0}]
[null,null,null,null,null,null,null,null,null,null,null,null,null,null,null,{"$f":"J4615+O4615","v":0}]
[null,null,null,null,null,null,null,null,null,null,null,null,null,null,null,{"$f":"J4616+O4616","v":0}]
[null,null,null,null,null,null,null,null,null,null,null,null,null,null,null,{"$f":"J4617+O4617","v":0}]
[null,null,null,null,null,null,null,null,null,null,null,null,null,null,null,{"$f":"J4618+O4618","v":0}]
[null,null,null,null,null,null,null,null,null,null,null,null,null,null,null,{"$f":"J4619+O4619","v":0}]
[null,null,null,null,null,null,null,null,null,null,null,null,null,null,null,{"$f":"J4620+O4620","v":0}]
[null,null,null,null,null,null,null,null,null,null,null,null,null,null,null,{"$f":"J4621+O4621","v":0}]
[null,null,null,null,null,null,null,null,null,null,null,null,null,null,null,{"$f":"J4622+O4622","v":0}]
[null,null,null,null,null,null,null,null,null,null,null,null,null,null,null,{"$f":"J4623+O4623","v":0}]
[null,null,null,null,null,null,null,null,null,null,null,null,null,null,null,{"$f":"J4624+O4624","v":0}]
[null,null,null,null,null,null,null,null,null,null,null,null,null,null,null,{"$f":"J4625+O4625","v":0}]
[null,null,null,null,null,null,null,null,null,null,null,null,null,null,null,{"$f":"J4626+O4626","v":0}]
[null,null,null,null,null,null,null,null,null,null,null,null,null,null,null,{"$f":"J4627+O4627","v":0}]
[null,null,null,null,null,null,null,null,null,null,null,null,null,null,null,{"$f":"J4628+O4628","v":0}]
[null,null,null,null,null,null,null,null,null,null,null,null,null,null,null,{"$f":"J4629+O4629","v":0}]
[null,null,null,null,null,null,null,null,null,null,null,null,null,null,null,{"$f":"J4630+O4630","v":0}]
[null,null,null,null,null,null,null,null,null,null,null,null,null,null,null,{"$f":"J4631+O4631","v":0}]
[null,null,null,null,null,null,null,null,null,null,null,null,null,null,null,{"$f":"J4632+O4632","v":0}]
[null,null,null,null,null,null,null,null,null,null,null,null,null,null,null,{"$f":"J4633+O4633","v":0}]
[null,null,null,null,null,null,null,null,null,null,null,null,null,null,null,{"$f":"J4634+O4634","v":0}]
[null,null,null,null,null,null,null,null,null,null,null,null,null,null,null,{"$f":"J4635+O4635","v":0}]
[null,null,null,null,null,null,null,null,null,null,null,null,null,null,null,{"$f":"J4636+O4636","v":0}]
[null,null,null,null,null,null,null,null,null,null,null,null,null,null,null,{"$f":"J4637+O4637","v":0}]
[null,null,null,null,null,null,null,null,null,null,null,null,null,null,null,{"$f":"J4638+O4638","v":0}]
[null,null,null,null,null,null,null,null,null,null,null,null,null,null,null,{"$f":"J4639+O4639","v":0}]
[null,null,null,null,null,null,null,null,null,null,null,null,null,null,null,{"$f":"J4640+O4640","v":0}]
[null,null,null,null,null,null,null,null,null,null,null,null,null,null,null,{"$f":"J4641+O4641","v":0}]
[null,null,null,null,null,null,null,null,null,null,null,null,null,null,null,{"$f":"J4642+O4642","v":0}]
[null,null,null,null,null,null,null,null,null,null,null,null,null,null,null,{"$f":"J4643+O4643","v":0}]
[null,null,null,null,null,null,null,null,null,null,null,null,null,null,null,{"$f":"J4644+O4644","v":0}]
[null,null,null,null,null,null,null,null,null,null,null,null,null,null,null,{"$f":"J4645+O4645","v":0}]
[null,null,null,null,null,null,null,null,null,null,null,null,null,null,null,{"$f":"J4646+O4646","v":0}]
[null,null,null,null,null,null,null,null,null,null,null,null,null,null,null,{"$f":"J4647+O4647","v":0}]
[null,null,null,null,null,null,null,null,null,null,null,null,null,null,null,{"$f":"J4648+O4648","v":0}]
[null,null,null,null,null,null,null,null,null,null,null,null,null,null,null,{"$f":"J4649+O4649","v":0}]
[null,null,null,null,null,null,null,null,null,null,null,null,null,null,null,{"$f":"J4650+O4650","v":0}]
[null,null,null,null,null,null,null,null,null,null,null,null,null,null,null,{"$f":"J4651+O4651","v":0}]
[null,null,null,null,null,null,null,null,null,null,null,null,null,null,null,{"$f":"J4652+O4652","v":0}]
[null,null,null,null,null,null,null,null,null,null,null,null,null,null,null,{"$f":"J4653+O4653","v":0}]
[null,null,null,null,null,null,null,null,null,null,null,null,null,null,null,{"$f":"J4654+O4654","v":0}]
[null,null,null,null,null,null,null,null,null,null,null,null,null,null,null,{"$f":"J4655+O4655","v":0}]
[null,null,null,null,null,null,null,null,null,null,null,null,null,null,null,{"$f":"J4656+O4656","v":0}]
[null,null,null,null,null,null,null,null,null,null,null,null,null,null,null,{"$f":"J4657+O4657","v":0}]
[null,null,null,null,null,null,null,null,null,null,null,null,null,null,null,{"$f":"J4658+O4658","v":0}]
[null,null,null,null,null,null,null,null,null,null,null,null,null,null,null,{"$f":"J4659+O4659","v":0}]
[null,null,null,null,null,null,null,null,null,null,null,null,null,null,null,{"$f":"J4660+O4660","v":0}]
[null,null,null,null,null,null,null,null,null,null,null,null,null,null,null,{"$f":"J4661+O4661","v":0}]
[null,null,null,null,null,null,null,null,null,null,null,null,null,null,null,{"$f":"J4662+O4662","v":0}]
[null,null,null,null,null,null,null,null,null,null,null,null,null,null,null,{"$f":"J4663+O4663","v":0}]
[null,null,null,null,null,null,null,null,null,null,null,null,null,null,null,{"$f":"J4664+O4664","v":0}]
[null,null,null,null,null,null,null,null,null,null,null,null,null,null,null,{"$f":"J4665+O4665","v":0}]
[null,null,null,null,null,null,null,null,null,null,null,null,null,null,null,{"$f":"J4666+O4666","v":0}]
[null,null,null,null,null,null,null,null,null,null,null,null,null,null,null,{"$f":"J4667+O4667","v":0}]
[null,null,null,null,null,null,null,null,null,null,null,null,null,null,null,{"$f":"J4668+O4668","v":0}]
[null,null,null,null,null,null,null,null,null,null,null,null,null,null,null,{"$f":"J4669+O4669","v":0}]
[null,null,null,null,null,null,null,null,null,null,null,null,null,null,null,{"$f":"J4670+O4670","v":0}]
[null,null,null,null,null,null,null,null,null,null,null,null,null,null,null,{"$f":"J4671+O4671","v":0}]
[null,null,null,null,null,null,null,null,null,null,null,null,null,null,null,{"$f":"J4672+O4672","v":0}]
[null,null,null,null,null,null,null,null,null,null,null,null,null,null,null,{"$f":"J4673+O4673","v":0}]
[null,null,null,null,null,null,null,null,null,null,null,null,null,null,null,{"$f":"J4674+O4674","v":0}]
[null,null,null,null,null,null,null,null,null,null,null,null,null,null,null,{"$f":"J4675+O4675","v":0}]
[null,null,null,null,null,null,null,null,null,null,null,null,null,null,null,{"$f":"J4676+O4676","v":0}]
[null,null,null,null,null,null,null,null,null,null,null,null,null,null,null,{"$f":"J4677+O4677","v":0}]
[null,null,null,null,null,null,null,null,null,null,null,null,null,null,null,{"$f":"J4678+O4678","v":0}]
[null,null,null,null,null,null,null,null,null,null,null,null,null,null,null,{"$f":"J4679+O4679","v":0}]
[null,null,null,null,null,null,null,null,null,null,null,null,null,null,null,{"$f":"J4680+O4680","v":0}]
[null,null,null,null,null,null,null,null,null,null,null,null,null,null,null,{"$f":"J4681+O4681","v":0}]
[null,null,null,null,null,null,null,null,null,null,null,null,null,null,null,{"$f":"J4682+O4682","v":0}]
[null,null,null,null,null,null,null,null,null,null,null,null,null,null,null,{"$f":"J4683+O4683","v":0}]
[null,null,null,null,null,null,null,null,null,null,null,null,null,null,null,{"$f":"J4684+O4684","v":0}]
[null,null,null,null,null,null,null,null,null,null,null,null,null,null,null,{"$f":"J4685+O4685","v":0}]
[null,null,null,null,null,null,null,null,null,null,null,null,null,null,null,{"$f":"J4686+O4686","v":0}]
[null,null,null,null,null,null,null,null,null,null,null,null,null,null,null,{"$f":"J4687+O4687","v":0}]
[null,null,null,null,null,null,null,null,null,null,null,null,null,null,null,{"$f":"J4688+O4688","v":0}]
[null,null,null,null,null,null,null,null,null,null,null,null,null,null,null,{"$f":"J4689+O4689","v":0}]
[null,null,null,null,null,null,null,null,null,null,null,null,null,null,null,{"$f":"J4690+O4690","v":0}]
[null,null,null,null,null,null,null,null,null,null,null,null,null,null,null,{"$f":"J4691+O4691","v":0}]
[null,null,null,null,null,null,null,null,null,null,null,null,null,null,null,{"$f":"J4692+O4692","v":0}]
[null,null,null,null,null,null,null,null,null,null,null,null,null,null,null,{"$f":"J4693+O4693","v":0}]
[null,null,null,null,null,null,null,null,null,null,null,null,null,null,null,{"$f":"J4694+O4694","v":0}]
[null,null,null,null,null,null,null,null,null,null,null,null,null,null,null,{"$f":"J4695+O4695","v":0}]
[null,null,null,null,null,null,null,null,null,null,null,null,null,null,null,{"$f":"J4696+O4696","v":0}]
[null,null,null,null,null,null,null,null,null,null,null,null,null,null,null,{"$f":"J4697+O4697","v":0}]
[null,null,null,null,null,null,null,null,null,null,null,null,null,null,null,{"$f":"J4698+O4698","v":0}]
[null,null,null,null,null,null,null,null,null,null,null,null,null,null,null,{"$f":"J4699+O4699","v":0}]
[null,null,null,null,null,null,null,null,null,null,null,null,null,null,null,{"$f":"J4700+O4700","v":0}]
[null,null,null,null,null,null,null,null,null,null,null,null,null,null,null,{"$f":"J4701+O4701","v":0}]
[null,null,null,null,null,null,null,null,null,null,null,null,null,null,null,{"$f":"J4702+O4702","v":0}]
[null,null,null,null,null,null,null,null,null,null,null,null,null,null,null,{"$f":"J4703+O4703","v":0}]
[null,null,null,null,null,null,null,null,null,null,null,null,null,null,null,{"$f":"J4704+O4704","v":0}]
[null,null,null,null,null,null,null,null,null,null,null,null,null,null,null,{"$f":"J4705+O4705","v":0}]
[null,null,null,null,null,null,null,null,null,null,null,null,null,null,null,{"$f":"J4706+O4706","v":0}]
[null,null,null,null,null,null,null,null,null,null,null,null,null,null,null,{"$f":"J4707+O4707","v":0}]
[null,null,null,null,null,null,null,null,null,null,null,null,null,null,null,{"$f":"J4708+O4708","v":0}]
[null,null,null,null,null,null,null,null,null,null,null,null,null,null,null,{"$f":"J4709+O4709","v":0}]
[null,null,null,null,null,null,null,null,null,null,null,null,null,null,null,{"$f":"J4710+O4710","v":0}]
[null,null,null,null,null,null,null,null,null,null,null,null,null,null,null,{"$f":"J4711+O4711","v":0}]
[null,null,null,null,null,null,null,null,null,null,null,null,null,null,null,{"$f":"J4712+O4712","v":0}]
[null,null,null,null,null,null,null,null,null,null,null,null,null,null,null,{"$f":"J4713+O4713","v":0}]
[null,null,null,null,null,null,null,null,null,null,null,null,null,null,null,{"$f":"J4714+O4714","v":0}]
[null,null,null,null,null,null,null,null,null,null,null,null,null,null,null,{"$f":"J4715+O4715","v":0}]
[null,null,null,null,null,null,null,null,null,null,null,null,null,null,null,{"$f":"J4716+O4716","v":0}]
[null,null,null,null,null,null,null,null,null,null,null,null,null,null,null,{"$f":"J4717+O4717","v":0}]
[null,null,null,null,null,null,null,null,null,null,null,null,null,null,null,{"$f":"J4718+O4718","v":0}]
[null,null,null,null,null,null,null,null,null,null,null,null,null,null,null,{"$f":"J4719+O4719","v":0}]
[null,null,null,null,null,null,null,null,null,null,null,null,null,null,null,{"$f":"J4720+O4720","v":0}]
[null,null,null,null,null,null,null,null,null,null,null,null,null,null,null,{"$f":"J4721+O4721","v":0}]
[null,null,null,null,null,null,null,null,null,null,null,null,null,null,null,{"$f":"J4722+O4722","v":0}]
[null,null,null,null,null,null,null,null,null,null,null,null,null,null,null,{"$f":"J4723+O4723","v":0}]
[null,null,null,null,null,null,null,null,null,null,null,null,null,null,null,{"$f":"J4724+O4724","v":0}]
[null,null,null,null,null,null,null,null,null,null,null,null,null,null,null,{"$f":"J4725+O4725","v":0}]
[null,null,null,null,null,null,null,null,null,null,null,null,null,null,null,{"$f":"J4726+O4726","v":0}]
[null,null,null,null,null,null,null,null,null,null,null,null,null,null,null,{"$f":"J4727+O4727","v":0}]
[null,null,null,null,null,null,null,null,null,null,null,null,null,null,null,{"$f":"J4728+O4728","v":0}]
[null,null,null,null,null,null,null,null,null,null,null,null,null,null,null,{"$f":"J4729+O4729","v":0}]
[null,null,null,null,null,null,null,null,null,null,null,null,null,null,null,{"$f":"J4730+O4730","v":0}]
[null,null,null,null,null,null,null,null,null,null,null,null,null,null,null,{"$f":"J4731+O4731","v":0}]
[null,null,null,null,null,null,null,null,null,null,null,null,null,null,null,{"$f":"J4732+O4732","v":0}]
[null,null,null,null,null,null,null,null,null,null,null,null,null,null,null,{"$f":"J4733+O4733","v":0}]
[null,null,null,null,null,null,null,null,null,null,null,null,null,null,null,{"$f":"J4734+O4734","v":0}]
[null,null,null,null,null,null,null,null,null,null,null,null,null,null,null,{"$f":"J4735+O4735","v":0}]
[null,null,null,null,null,null,null,null,null,null,null,null,null,null,null,{"$f":"J4736+O4736","v":0}]
[null,null,null,null,null,null,null,null,null,null,null,null,null,null,null,{"$f":"J4737+O4737","v":0}]
[null,null,null,null,null,null,null,null,null,null,null,null,null,null,null,{"$f":"J4738+O4738","v":0}]
[null,null,null,null,null,null,null,null,null,null,null,null,null,null,null,{"$f":"J4739+O4739","v":0}]
[null,null,null,null,null,null,null,null,null,null,null,null,null,null,null,{"$f":"J4740+O4740","v":0}]
[null,null,null,null,null,null,null,null,null,null,null,null,null,null,null,{"$f":"J4741+O4741","v":0}]
[null,null,null,null,null,null,null,null,null,null,null,null,null,null,null,{"$f":"J4742+O4742","v":0}]
[null,null,null,null,null,null,null,null,null,null,null,null,null,null,null,{"$f":"J4743+O4743","v":0}]
[null,null,null,null,null,null,null,null,null,null,null,null,null,null,null,{"$f":"J4744+O4744","v":0}]
[null,null,null,null,null,null,null,null,null,null,null,null,null,null,null,{"$f":"J4745+O4745","v":0}]
[null,null,null,null,null,null,null,null,null,null,null,null,null,null,null,{"$f":"J4746+O4746","v":0}]
[null,null,null,null,null,null,null,null,null,null,null,null,null,null,null,{"$f":"J4747+O4747","v":0}]
[null,null,null,null,null,null,null,null,null,null,null,null,null,null,null,{"$f":"J4748+O4748","v":0}]
[null,null,null,null,null,null,null,null,null,null,null,null,null,null,null,{"$f":"J4749+O4749","v":0}]
[null,null,null,null,null,null,null,null,null,null,null,null,null,null,null,{"$f":"J4750+O4750","v":0}]
[null,null,null,null,null,null,null,null,null,null,null,null,null,null,null,{"$f":"J4751+O4751","v":0}]
[null,null,null,null,null,null,null,null,null,null,null,null,null,null,null,{"$f":"J4752+O4752","v":0}]
[null,null,null,null,null,null,null,null,null,null,null,null,null,null,null,{"$f":"J4753+O4753","v":0}]
[null,null,null,null,null,null,null,null,null,null,null,null,null,null,null,{"$f":"J4754+O4754","v":0}]
[null,null,null,null,null,null,null,null,null,null,null,null,null,null,null,{"$f":"J4755+O4755","v":0}]
[null,null,null,null,null,null,null,null,null,null,null,null,null,null,null,{"$f":"J4756+O4756","v":0}]
[null,null,null,null,null,null,null,null,null,null,null,null,null,null,null,{"$f":"J4757+O4757","v":0}]
[null,null,null,null,null,null,null,null,null,null,null,null,null,null,null,{"$f":"J4758+O4758","v":0}]
[null,null,null,null,null,null,null,null,null,null,null,null,null,null,null,{"$f":"J4759+O4759","v":0}]
[null,null,null,null,null,null,null,null,null,null,null,null,null,null,null,{"$f":"J4760+O4760","v":0}]
[null,null,null,null,null,null,null,null,null,null,null,null,null,null,null,{"$f":"J4761+O4761","v":0}]
[null,null,null,null,null,null,null,null,null,null,null,null,null,null,null,{"$f":"J4762+O4762","v":0}]
[null,null,null,null,null,null,null,null,null,null,null,null,null,null,null,{"$f":"J4763+O4763","v":0}]
[null,null,null,null,null,null,null,null,null,null,null,null,null,null,null,{"$f":"J4764+O4764","v":0}]
[null,null,null,null,null,null,null,null,null,null,null,null,null,null,null,{"$f":"J4765+O4765","v":0}]
[null,null,null,null,null,null,null,null,null,null,null,null,null,null,null,{"$f":"J4766+O4766","v":0}]
[null,null,null,null,null,null,null,null,null,null,null,null,null,null,null,{"$f":"J4767+O4767","v":0}]
[null,null,null,null,null,null,null,null,null,null,null,null,null,null,null,{"$f":"J4768+O4768","v":0}]
[null,null,null,null,null,null,null,null,null,null,null,null,null,null,null,{"$f":"J4769+O4769","v":0}]
[null,null,null,null,null,null,null,null,null,null,null,null,null,null,null,{"$f":"J4770+O4770","v":0}]
[null,null,null,null,null,null,null,null,null,null,null,null,null,null,null,{"$f":"J4771+O4771","v":0}]
[null,null,null,null,null,null,null,null,null,null,null,null,null,null,null,{"$f":"J4772+O4772","v":0}]
[null,null,null,null,null,null,null,null,null,null,null,null,null,null,null,{"$f":"J4773+O4773","v":0}]
[null,null,null,null,null,null,null,null,null,null,null,null,null,null,null,{"$f":"J4774+O4774","v":0}]
[null,null,null,null,null,null,null,null,null,null,null,null,null,null,null,{"$f":"J4775+O4775","v":0}]
[null,null,null,null,null,null,null,null,null,null,null,null,null,null,null,{"$f":"J4776+O4776","v":0}]
[null,null,null,null,null,null,null,null,null,null,null,null,null,null,null,{"$f":"J4777+O4777","v":0}]
[null,null,null,null,null,null,null,null,null,null,null,null,null,null,null,{"$f":"J4778+O4778","v":0}]
[null,null,null,null,null,null,null,null,null,null,null,null,null,null,null,{"$f":"J4779+O4779","v":0}]
[null,null,null,null,null,null,null,null,null,null,null,null,null,null,null,{"$f":"J4780+O4780","v":0}]
[null,null,null,null,null,null,null,null,null,null,null,null,null,null,null,{"$f":"J4781+O4781","v":0}]
[null,null,null,null,null,null,null,null,null,null,null,null,null,null,null,{"$f":"J4782+O4782","v":0}]
[null,null,null,null,null,null,null,null,null,null,null,null,null,null,null,{"$f":"J4783+O4783","v":0}]
[null,null,null,null,null,null,null,null,null,null,null,null,null,null,null,{"$f":"J4784+O4784","v":0}]
[null,null,null,null,null,null,null,null,null,null,null,null,null,null,null,{"$f":"J4785+O4785","v":0}]
[null,null,null,null,null,null,null,null,null,null,null,null,null,null,null,{"$f":"J4786+O4786","v":0}]
[null,null,null,null,null,null,null,null,null,null,null,null,null,null,null,{"$f":"J4787+O4787","v":0}]
[null,null,null,null,null,null,null,null,null,null,null,null,null,null,null,{"$f":"J4788+O4788","v":0}]
[null,null,null,null,null,null,null,null,null,null,null,null,null,null,null,{"$f":"J4789+O4789","v":0}]
[null,null,null,null,null,null,null,null,null,null,null,null,null,null,null,{"$f":"J4790+O4790","v":0}]
[null,null,null,null,null,null,null,null,null,null,null,null,null,null,null,{"$f":"J4791+O4791","v":0}]
[null,null,null,null,null,null,null,null,null,null,null,null,null,null,null,{"$f":"J4792+O4792","v":0}]
[null,null,null,null,null,null,null,null,null,null,null,null,null,null,null,{"$f":"J4793+O4793","v":0}]
[null,null,null,null,null,null,null,null,null,null,null,null,null,null,null,{"$f":"J4794+O4794","v":0}]
[null,null,null,null,null,null,null,null,null,null,null,null,null,null,null,{"$f":"J4795+O4795","v":0}]
[null,null,null,null,null,null,null,null,null,null,null,null,null,null,null,{"$f":"J4796+O4796","v":0}]
[null,null,null,null,null,null,null,null,null,null,null,null,null,null,null,{"$f":"J4797+O4797","v":0}]
[null,null,null,null,null,null,null,null,null,null,null,null,null,null,null,{"$f":"J4798+O4798","v":0}]
[null,null,null,null,null,null,null,null,null,null,null,null,null,null,null,{"$f":"J4799+O4799","v":0}]
[null,null,null,null,null,null,null,null,null,null,null,null,null,null,null,{"$f":"J4800+O4800","v":0}]
[null,null,null,null,null,null,null,null,null,null,null,null,null,null,null,{"$f":"J4801+O4801","v":0}]
[null,null,null,null,null,null,null,null,null,null,null,null,null,null,null,{"$f":"J4802+O4802","v":0}]
[null,null,null,null,null,null,null,null,null,null,null,null,null,null,null,{"$f":"J4803+O4803","v":0}]
[null,null,null,null,null,null,null,null,null,null,null,null,null,null,null,{"$f":"J4804+O4804","v":0}]
[null,null,null,null,null,null,null,null,null,null,null,null,null,null,null,{"$f":"J4805+O4805","v":0}]
[null,null,null,null,null,null,null,null,null,null,null,null,null,null,null,{"$f":"J4806+O4806","v":0}]
[null,null,null,null,null,null,null,null,null,null,null,null,null,null,null,{"$f":"J4807+O4807","v":0}]
[null,null,null,null,null,null,null,null,null,null,null,null,null,null,null,{"$f":"J4808+O4808","v":0}]
[null,null,null,null,null,null,null,null,null,null,null,null,null,null,null,{"$f":"J4809+O4809","v":0}]
[null,null,null,null,null,null,null,null,null,null,null,null,null,null,null,{"$f":"J4810+O4810","v":0}]
[null,null,null,null,null,null,null,null,null,null,null,null,null,null,null,{"$f":"J4811+O4811","v":0}]
[null,null,null,null,null,null,null,null,null,null,null,null,null,null,null,{"$f":"J4812+O4812","v":0}]
[null,null,null,null,null,null,null,null,null,null,null,null,null,null,null,{"$f":"J4813+O4813","v":0}]
[null,null,null,null,null,null,null,null,null,null,null,null,null,null,null,{"$f":"J4814+O4814","v":0}]
[null,null,null,null,null,null,null,null,null,null,null,null,null,null,null,{"$f":"J4815+O4815","v":0}]
[null,null,null,null,null,null,null,null,null,null,null,null,null,null,null,{"$f":"J4816+O4816","v":0}]
[null,null,null,null,null,null,null,null,null,null,null,null,null,null,null,{"$f":"J4817+O4817","v":0}]
[null,null,null,null,null,null,null,null,null,null,null,null,null,null,null,{"$f":"J4818+O4818","v":0}]
[null,null,null,null,null,null,null,null,null,null,null,null,null,null,null,{"$f":"J4819+O4819","v":0}]
[null,null,null,null,null,null,null,null,null,null,null,null,null,null,null,{"$f":"J4820+O4820","v":0}]
[null,null,null,null,null,null,null,null,null,null,null,null,null,null,null,{"$f":"J4821+O4821","v":0}]
[null,null,null,null,null,null,null,null,null,null,null,null,null,null,null,{"$f":"J4822+O4822","v":0}]
[null,null,null,null,null,null,null,null,null,null,null,null,null,null,null,{"$f":"J4823+O4823","v":0}]
[null,null,null,null,null,null,null,null,null,null,null,null,null,null,null,{"$f":"J4824+O4824","v":0}]
[null,null,null,null,null,null,null,null,null,null,null,null,null,null,null,{"$f":"J4825+O4825","v":0}]
[null,null,null,null,null,null,null,null,null,null,null,null,null,null,null,{"$f":"J4826+O4826","v":0}]
[null,null,null,null,null,null,null,null,null,null,null,null,null,null,null,{"$f":"J4827+O4827","v":0}]
[null,null,null,null,null,null,null,null,null,null,null,null,null,null,null,{"$f":"J4828+O4828","v":0}]
[null,null,null,null,null,null,null,null,null,null,null,null,null,null,null,{"$f":"J4829+O4829","v":0}]
[null,null,null,null,null,null,null,null,null,null,null,null,null,null,null,{"$f":"J4830+O4830","v":0}]
[null,null,null,null,null,null,null,null,null,null,null,null,null,null,null,{"$f":"J4831+O4831","v":0}]
[null,null,null,null,null,null,null,null,null,null,null,null,null,null,null,{"$f":"J4832+O4832","v":0}]
[null,null,null,null,null,null,null,null,null,null,null,null,null,null,null,{"$f":"J4833+O4833","v":0}]
[null,null,null,null,null,null,null,null,null,null,null,null,null,null,null,{"$f":"J4834+O4834","v":0}]
[null,null,null,null,null,null,null,null,null,null,null,null,null,null,null,{"$f":"J4835+O4835","v":0}]
[null,null,null,null,null,null,null,null,null,null,null,null,null,null,null,{"$f":"J4836+O4836","v":0}]
[null,null,null,null,null,null,null,null,null,null,null,null,null,null,null,{"$f":"J4837+O4837","v":0}]
[null,null,null,null,null,null,null,null,null,null,null,null,null,null,null,{"$f":"J4838+O4838","v":0}]
[null,null,null,null,null,null,null,null,null,null,null,null,null,null,null,{"$f":"J4839+O4839","v":0}]
[null,null,null,null,null,null,null,null,null,null,null,null,null,null,null,{"$f":"J4840+O4840","v":0}]
[null,null,null,null,null,null,null,null,null,null,null,null,null,null,null,{"$f":"J4841+O4841","v":0}]
[null,null,null,null,null,null,null,null,null,null,null,null,null,null,null,{"$f":"J4842+O4842","v":0}]
[null,null,null,null,null,null,null,null,null,null,null,null,null,null,null,{"$f":"J4843+O4843","v":0}]
[null,null,null,null,null,null,null,null,null,null,null,null,null,null,null,{"$f":"J4844+O4844","v":0}]
[null,null,null,null,null,null,null,null,null,null,null,null,null,null,null,{"$f":"J4845+O4845","v":0}]
[null,null,null,null,null,null,null,null,null,null,null,null,null,null,null,{"$f":"J4846+O4846","v":0}]
[null,null,null,null,null,null,null,null,null,null,null,null,null,null,null,{"$f":"J4847+O4847","v":0}]
[null,null,null,null,null,null,null,null,null,null,null,null,null,null,null,{"$f":"J4848+O4848","v":0}]
[null,null,null,null,null,null,null,null,null,null,null,null,null,null,null,{"$f":"J4849+O4849","v":0}]
[null,null,null,null,null,null,null,null,null,null,null,null,null,null,null,{"$f":"J4850+O4850","v":0}]
[null,null,null,null,null,null,null,null,null,null,null,null,null,null,null,{"$f":"J4851+O4851","v":0}]
[null,null,null,null,null,null,null,null,null,null,null,null,null,null,null,{"$f":"J4852+O4852","v":0}]
[null,null,null,null,null,null,null,null,null,null,null,null,null,null,null,{"$f":"J4853+O4853","v":0}]
[null,null,null,null,null,null,null,null,null,null,null,null,null,null,null,{"$f":"J4854+O4854","v":0}]
[null,null,null,null,null,null,null,null,null,null,null,null,null,null,null,{"$f":"J4855+O4855","v":0}]
[null,null,null,null,null,null,null,null,null,null,null,null,null,null,null,{"$f":"J4856+O4856","v":0}]
[null,null,null,null,null,null,null,null,null,null,null,null,null,null,null,{"$f":"J4857+O4857","v":0}]
[null,null,null,null,null,null,null,null,null,null,null,null,null,null,null,{"$f":"J4858+O4858","v":0}]
[null,null,null,null,null,null,null,null,null,null,null,null,null,null,null,{"$f":"J4859+O4859","v":0}]
[null,null,null,null,null,null,null,null,null,null,null,null,null,null,null,{"$f":"J4860+O4860","v":0}]
[null,null,null,null,null,null,null,null,null,null,null,null,null,null,null,{"$f":"J4861+O4861","v":0}]
[null,null,null,null,null,null,null,null,null,null,null,null,null,null,null,{"$f":"J4862+O4862","v":0}]
[null,null,null,null,null,null,null,null,null,null,null,null,null,null,null,{"$f":"J4863+O4863","v":0}]
[null,null,null,null,null,null,null,null,null,null,null,null,null,null,null,{"$f":"J4864+O4864","v":0}]
[null,null,null,null,null,null,null,null,null,null,null,null,null,null,null,{"$f":"J4865+O4865","v":0}]
[null,null,null,null,null,null,null,null,null,null,null,null,null,null,null,{"$f":"J4866+O4866","v":0}]
[null,null,null,null,null,null,null,null,null,null,null,null,null,null,null,{"$f":"J4867+O4867","v":0}]
[null,null,null,null,null,null,null,null,null,null,null,null,null,null,null,{"$f":"J4868+O4868","v":0}]
[null,null,null,null,null,null,null,null,null,null,null,null,null,null,null,{"$f":"J4869+O4869","v":0}]
[null,null,null,null,null,null,null,null,null,null,null,null,null,null,null,{"$f":"J4870+O4870","v":0}]
[null,null,null,null,null,null,null,null,null,null,null,null,null,null,null,{"$f":"J4871+O4871","v":0}]
[null,null,null,null,null,null,null,null,null,null,null,null,null,null,null,{"$f":"J4872+O4872","v":0}]
[null,null,null,null,null,null,null,null,null,null,null,null,null,null,null,{"$f":"J4873+O4873","v":0}]
[null,null,null,null,null,null,null,null,null,null,null,null,null,null,null,{"$f":"J4874+O4874","v":0}]
[null,null,null,null,null,null,null,null,null,null,null,null,null,null,null,{"$f":"J4875+O4875","v":0}]
[null,null,null,null,null,null,null,null,null,null,null,null,null,null,null,{"$f":"J4876+O4876","v":0}]
[null,null,null,null,null,null,null,null,null,null,null,null,null,null,null,{"$f":"J4877+O4877","v":0}]
[null,null,null,null,null,null,null,null,null,null,null,null,null,null,null,{"$f":"J4878+O4878","v":0}]
[null,null,null,null,null,null,null,null,null,null,null,null,null,null,null,{"$f":"J4879+O4879","v":0}]
[null,null,null,null,null,null,null,null,null,null,null,null,null,null,null,{"$f":"J4880+O4880","v":0}]
[null,null,null,null,null,null,null,null,null,null,null,null,null,null,null,{"$f":"J4881+O4881","v":0}]
[null,null,null,null,null,null,null,null,null,null,null,null,null,null,null,{"$f":"J4882+O4882","v":0}]
[null,null,null,null,null,null,null,null,null,null,null,null,null,null,null,{"$f":"J4883+O4883","v":0}]
[null,null,null,null,null,null,null,null,null,null,null,null,null,null,null,{"$f":"J4884+O4884","v":0}]
[null,null,null,null,null,null,null,null,null,null,null,null,null,null,null,{"$f":"J4885+O4885","v":0}]
[null,null,null,null,null,null,null,null,null,null,null,null,null,null,null,{"$f":"J4886+O4886","v":0}]
[null,null,null,null,null,null,null,null,null,null,null,null,null,null,null,{"$f":"J4887+O4887","v":0}]
[null,null,null,null,null,null,null,null,null,null,null,null,null,null,null,{"$f":"J4888+O4888","v":0}]
[null,null,null,null,null,null,null,null,null,null,null,null,null,null,null,{"$f":"J4889+O4889","v":0}]
[null,null,null,null,null,null,null,null,null,null,null,null,null,null,null,{"$f":"J4890+O4890","v":0}]
[null,null,null,null,null,null,null,null,null,null,null,null,null,null,null,{"$f":"J4891+O4891","v":0}]
[null,null,null,null,null,null,null,null,null,null,null,null,null,null,null,{"$f":"J4892+O4892","v":0}]
[null,null,null,null,null,null,null,null,null,null,null,null,null,null,null,{"$f":"J4893+O4893","v":0}]
[null,null,null,null,null,null,null,null,null,null,null,null,null,null,null,{"$f":"J4894+O4894","v":0}]
[null,null,null,null,null,null,null,null,null,null,null,null,null,null,null,{"$f":"J4895+O4895","v":0}]
[null,null,null,null,null,null,null,null,null,null,null,null,null,null,null,{"$f":"J4896+O4896","v":0}]
[null,null,null,null,null,null,null,null,null,null,null,null,null,null,null,{"$f":"J4897+O4897","v":0}]
[null,null,null,null,null,null,null,null,null,null,null,null,null,null,null,{"$f":"J4898+O4898","v":0}]
[null,null,null,null,null,null,null,null,null,null,null,null,null,null,null,{"$f":"J4899+O4899","v":0}]
[null,null,null,null,null,null,null,null,null,null,null,null,null,null,null,{"$f":"J4900+O4900","v":0}]
[null,null,null,null,null,null,null,null,null,null,null,null,null,null,null,{"$f":"J4901+O4901","v":0}]
[null,null,null,null,null,null,null,null,null,null,null,null,null,null,null,{"$f":"J4902+O4902","v":0}]
[null,null,null,null,null,null,null,null,null,null,null,null,null,null,null,{"$f":"J4903+O4903","v":0}]
[null,null,null,null,null,null,null,null,null,null,null,null,null,null,null,{"$f":"J4904+O4904","v":0}]
[null,null,null,null,null,null,null,null,null,null,null,null,null,null,null,{"$f":"J4905+O4905","v":0}]
[null,null,null,null,null,null,null,null,null,null,null,null,null,null,null,{"$f":"J4906+O4906","v":0}]
[null,null,null,null,null,null,null,null,null,null,null,null,null,null,null,{"$f":"J4907+O4907","v":0}]
[null,null,null,null,null,null,null,null,null,null,null,null,null,null,null,{"$f":"J4908+O4908","v":0}]
[null,null,null,null,null,null,null,null,null,null,null,null,null,null,null,{"$f":"J4909+O4909","v":0}]
[null,null,null,null,null,null,null,null,null,null,null,null,null,null,null,{"$f":"J4910+O4910","v":0}]
[null,null,null,null,null,null,null,null,null,null,null,null,null,null,null,{"$f":"J4911+O4911","v":0}]
[null,null,null,null,null,null,null,null,null,null,null,null,null,null,null,{"$f":"J4912+O4912","v":0}]
[null,null,null,null,null,null,null,null,null,null,null,null,null,null,null,{"$f":"J4913+O4913","v":0}]
[null,null,null,null,null,null,null,null,null,null,null,null,null,null,null,{"$f":"J4914+O4914","v":0}]
[null,null,null,null,null,null,null,null,null,null,null,null,null,null,null,{"$f":"J4915+O4915","v":0}]
[null,null,null,null,null,null,null,null,null,null,null,null,null,null,null,{"$f":"J4916+O4916","v":0}]
[null,null,null,null,null,null,null,null,null,null,null,null,null,null,null,{"$f":"J4917+O4917","v":0}]
[null,null,null,null,null,null,null,null,null,null,null,null,null,null,null,{"$f":"J4918+O4918","v":0}]
[null,null,null,null,null,null,null,null,null,null,null,null,null,null,null,{"$f":"J4919+O4919","v":0}]
[null,null,null,null,null,null,null,null,null,null,null,null,null,null,null,{"$f":"J4920+O4920","v":0}]
[null,null,null,null,null,null,null,null,null,null,null,null,null,null,null,{"$f":"J4921+O4921","v":0}]
[null,null,null,null,null,null,null,null,null,null,null,null,null,null,null,{"$f":"J4922+O4922","v":0}]
[null,null,null,null,null,null,null,null,null,null,null,null,null,null,null,{"$f":"J4923+O4923","v":0}]
[null,null,null,null,null,null,null,null,null,null,null,null,null,null,null,{"$f":"J4924+O4924","v":0}]
[null,null,null,null,null,null,null,null,null,null,null,null,null,null,null,{"$f":"J4925+O4925","v":0}]
[null,null,null,null,null,null,null,null,null,null,null,null,null,null,null,{"$f":"J4926+O4926","v":0}]
[null,null,null,null,null,null,null,null,null,null,null,null,null,null,null,{"$f":"J4927+O4927","v":0}]
[null,null,null,null,null,null,null,null,null,null,null,null,null,null,null,{"$f":"J4928+O4928","v":0}]
[null,null,null,null,null,null,null,null,null,null,null,null,null,null,null,{"$f":"J4929+O4929","v":0}]
[null,null,null,null,null,null,null,null,null,null,null,null,null,null,null,{"$f":"J4930+O4930","v":0}]
[null,null,null,null,null,null,null,null,null,null,null,null,null,null,null,{"$f":"J4931+O4931","v":0}]
[null,null,null,null,null,null,null,null,null,null,null,null,null,null,null,{"$f":"J4932+O4932","v":0}]
[null,null,null,null,null,null,null,null,null,null,null,null,null,null,null,{"$f":"J4933+O4933","v":0}]
[null,null,null,null,null,null,null,null,null,null,null,null,null,null,null,{"$f":"J4934+O4934","v":0}]
[null,null,null,null,null,null,null,null,null,null,null,null,null,null,null,{"$f":"J4935+O4935","v":0}]
[null,null,null,null,null,null,null,null,null,null,null,null,null,null,null,{"$f":"J4936+O4936","v":0}]
[null,null,null,null,null,null,null,null,null,null,null,null,null,null,null,{"$f":"J4937+O4937","v":0}]
[null,null,null,null,null,null,null,null,null,null,null,null,null,null,null,{"$f":"J4938+O4938","v":0}]
[null,null,null,null,null,null,null,null,null,null,null,null,null,null,null,{"$f":"J4939+O4939","v":0}]
[null,null,null,null,null,null,null,null,null,null,null,null,null,null,null,{"$f":"J4940+O4940","v":0}]
[null,null,null,null,null,null,null,null,null,null,null,null,null,null,null,{"$f":"J4941+O4941","v":0}]
[null,null,null,null,null,null,null,null,null,null,null,null,null,null,null,{"$f":"J4942+O4942","v":0}]
[null,null,null,null,null,null,null,null,null,null,null,null,null,null,null,{"$f":"J4943+O4943","v":0}]
[null,null,null,null,null,null,null,null,null,null,null,null,null,null,null,{"$f":"J4944+O4944","v":0}]
[null,null,null,null,null,null,null,null,null,null,null,null,null,null,null,{"$f":"J4945+O4945","v":0}]
[null,null,null,null,null,null,null,null,null,null,null,null,null,null,null,{"$f":"J4946+O4946","v":0}]
[null,null,null,null,null,null,null,null,null,null,null,null,null,null,null,{"$f":"J4947+O4947","v":0}]
[null,null,null,null,null,null,null,null,null,null,null,null,null,null,null,{"$f":"J4948+O4948","v":0}]
[null,null,null,null,null,null,null,null,null,null,null,null,null,null,null,{"$f":"J4949+O4949","v":0}]
[null,null,null,null,null,null,null,null,null,null,null,null,null,null,null,{"$f":"J4950+O4950","v":0}]
[null,null,null,null,null,null,null,null,null,null,null,null,null,null,null,{"$f":"J4951+O4951","v":0}]
[null,null,null,null,null,null,null,null,null,null,null,null,null,null,null,{"$f":"J4952+O4952","v":0}]
[null,null,null,null,null,null,null,null,null,null,null,null,null,null,null,{"$f":"J4953+O4953","v":0}]
[null,null,null,null,null,null,null,null,null,null,null,null,null,null,null,{"$f":"J4954+O4954","v":0}]
[null,null,null,null,null,null,null,null,null,null,null,null,null,null,null,{"$f":"J4955+O4955","v":0}]
[null,null,null,null,null,null,null,null,null,null,null,null,null,null,null,{"$f":"J4956+O4956","v":0}]
[null,null,null,null,null,null,null,null,null,null,null,null,null,null,null,{"$f":"J4957+O4957","v":0}]
[null,null,null,null,null,null,null,null,null,null,null,null,null,null,null,{"$f":"J4958+O4958","v":0}]
[null,null,null,null,null,null,null,null,null,null,null,null,null,null,null,{"$f":"J4959+O4959","v":0}]
[null,null,null,null,null,null,null,null,null,null,null,null,null,null,null,{"$f":"J4960+O4960","v":0}]
[null,null,null,null,null,null,null,null,null,null,null,null,null,null,null,{"$f":"J4961+O4961","v":0}]
[null,null,null,null,null,null,null,null,null,null,null,null,null,null,null,{"$f":"J4962+O4962","v":0}]
[null,null,null,null,null,null,null,null,null,null,null,null,null,null,null,{"$f":"J4963+O4963","v":0}]
[null,null,null,null,null,null,null,null,null,null,null,null,null,null,null,{"$f":"J4964+O4964","v":0}]
[null,null,null,null,null,null,null,null,null,null,null,null,null,null,null,{"$f":"J4965+O4965","v":0}]
[null,null,null,null,null,null,null,null,null,null,null,null,null,null,null,{"$f":"J4966+O4966","v":0}]
[null,null,null,null,null,null,null,null,null,null,null,null,null,null,null,{"$f":"J4967+O4967","v":0}]
[null,null,null,null,null,null,null,null,null,null,null,null,null,null,null,{"$f":"J4968+O4968","v":0}]
[null,null,null,null,null,null,null,null,null,null,null,null,null,null,null,{"$f":"J4969+O4969","v":0}]
[null,null,null,null,null,null,null,null,null,null,null,null,null,null,null,{"$f":"J4970+O4970","v":0}]
[null,null,null,null,null,null,null,null,null,null,null,null,null,null,null,{"$f":"J4971+O4971","v":0}]
[null,null,null,null,null,null,null,null,null,null,null,null,null,null,null,{"$f":"J4972+O4972","v":0}]
[null,null,null,null,null,null,null,null,null,null,null,null,null,null,null,{"$f":"J4973+O4973","v":0}]
[null,null,null,null,null,null,null,null,null,null,null,null,null,null,null,{"$f":"J4974+O4974","v":0}]
[null,null,null,null,null,null,null,null,null,null,null,null,null,null,null,{"$f":"J4975+O4975","v":0}]
[null,null,null,null,null,null,null,null,null,null,null,null,null,null,null,{"$f":"J4976+O4976","v":0}]
[null,null,null,null,null,null,null,null,null,null,null,null,null,null,null,{"$f":"J4977+O4977","v":0}]
[null,null,null,null,null,null,null,null,null,null,null,null,null,null,null,{"$f":"J4978+O4978","v":0}]
[null,null,null,null,null,null,null,null,null,null,null,null,null,null,null,{"$f":"J4979+O4979","v":0}]
[null,null,null,null,null,null,null,null,null,null,null,null,null,null,null,{"$f":"J4980+O4980","v":0}]
[null,null,null,null,null,null,null,null,null,null,null,null,null,null,null,{"$f":"J4981+O4981","v":0}]
[null,null,null,null,null,null,null,null,null,null,null,null,null,null,null,{"$f":"J4982+O4982","v":0}]
[null,null,null,null,null,null,null,null,null,null,null,null,null,null,null,{"$f":"J4983+O4983","v":0}]
[null,null,null,null,null,null,null,null,null,null,null,null,null,null,null,{"$f":"J4984+O4984","v":0}]
[null,null,null,null,null,null,null,null,null,null,null,null,null,null,null,{"$f":"J4985+O4985","v":0}]
[null,null,null,null,null,null,null,null,null,null,null,null,null,null,null,{"$f":"J4986+O4986","v":0}]
[null,null,null,null,null,null,null,null,null,null,null,null,null,null,null,{"$f":"J4987+O4987","v":0}]
[null,null,null,null,null,null,null,null,null,null,null,null,null,null,null,{"$f":"J4988+O4988","v":0}]
[null,null,null,null,null,null,null,null,null,null,null,null,null,null,null,{"$f":"J4989+O4989","v":0}]
[null,null,null,null,null,null,null,null,null,null,null,null,null,null,null,{"$f":"J4990+O4990","v":0}]
[null,null,null,null,null,null,null,null,null,null,null,null,null,null,null,{"$f":"J4991+O4991","v":0}]
[null,null,null,null,null,null,null,null,null,null,null,null,null,null,null,{"$f":"J4992+O4992","v":0}]
[null,null,null,null,null,null,null,null,null,null,null,null,null,null,null,{"$f":"J4993+O4993","v":0}]
[null,null,null,null,null,null,null,null,null,null,null,null,null,null,null,{"$f":"J4994+O4994","v":0}]
[null,null,null,null,null,null,null,null,null,null,null,null,null,null,null,{"$f":"J4995+O4995","v":0}]
[null,null,null,null,null,null,null,null,null,null,null,null,null,null,null,{"$f":"J4996+O4996","v":0}]
[null,null,null,null,null,null,null,null,null,null,null,null,null,null,null,{"$f":"J4997+O4997","v":0}]
[null,null,null,null,null,null,null,null,null,null,null,null,null,null,null,{"$f":"J4998+O4998","v":0}]
[null,null,null,null,null,null,null,null,null,null,null,null,null,null,null,{"$f":"J4999+O4999","v":0}]
[null,null,null,null,null,null,null,null,null,null,null,null,null,null,null,{"$f":"J5000+O5000","v":0}]
[null,null,null,null,null,null,null,null,null,null,null,null,null,null,null,{"$f":"J5001+O5001","v":0}]
[null,null,null,null,null,null,null,null,null,null,null,null,null,null,null,{"$f":"J5002+O5002","v":0}]
[null,null,null,null,null,null,null,null,null,null,null,null,null,null,null,{"$f":"J5003+O5003","v":0}]
[null,null,null,null,null,null,null,null,null,null,null,null,null,null,null,{"$f":"J5004+O5004","v":0}]
[null,null,null,null,null,null,null,null,null,null,null,null,null,null,null,{"$f":"J5005+O5005","v":0}]
[null,null,null,null,null,null,null,null,null,null,null,null,null,null,null,{"$f":"J5006+O5006","v":0}]

{"sheet":"Anwendungshilfe","index":4,"n_rows":205,"n_cols":10,"rows_kept":205,"cut":false,"hidden":false,"merged":[[65,2,65,3],[80,2,80,3],[81,2,81,3],[91,2,91,3],[32,2,32,3],[33,2,33,3],[34,2,34,3],[48,2,48,3],[49,2,49,3],[64,2,64,3]]}
[]
[null,"Anwendungshilfe für die Projektkostenerfassung"]
[]
[]
[]
[null,"Inhaltsübersicht"]
[]
[null,null,"1.","Technische Informationen zur Anwendung des Tools"]
[null,null,"2.","Praktische Hinweise zum Erstellen/Ausfüllen der Projektkostenerfassung"]
[null,null,"3.","Kostenlose Version vers. Premiumversion"]
[null,null,"4.","Betriebswirtschaftliche Betrachtungen zur Projektkostenerfassung"]
[]
[null,{"$f":"CONCATENATE($C$8,\" \",$D$8)","v":"1. Technische Informationen zur Anwendung des Tools"}]
[]
[null,null,"Das Tool besteht aktuell aus den folgenden Tabellenblättern und enthält keine Makros"]
[null,null,"Die einzelnen Tabellenblätter beinhalten:",null,"Wechsel zu Blatt …"]
[null,null,null,"» Kostenerfassung","Kosten"]
[null,null,null,"» Zeiterfassung","Zeiten"]
[null,null,null,"» Summen der Kosten und Zeiten je Projekt","Projektsummen"]
[null,null,null,"» Detailübersicht der einzelnen Positionen","Projektdetails"]
[null,null,null,"» Anwendungshilfe (dieses Tabellenblatt)"]
[]
[null,null,"Dieses Tool dient zur Erfassung und Analyse von Kosten und Zeiten, welche in Projekten anfallen oder auf Aufträge geschrieben werden"]
[null,null,"Es werden einige Excel-Funktionen und -Tricks verwendet, welche in der Premiumversion zusätzlich in Kommentaren erläutert werden"]
[null,null,"Dies sind u.a. folgende Funktionen in alphabetischer Reihenfolge:"]
[]
[null,null,null,"HEUTE"]
[null,null,null,"SUMME"]
[null,null,null,"SVERWEIS"]
[null,null,null,"TEILERGEBNIS"]
[null,null,null,"WENN"]
[null,null,null,"sowie Bedingte Formatierungen und Sprungmarken mit Hyperlinks auf Zellen und Namen"]
[]
[null,null,"Tabellenblatt: Kosten"]
[]
[null,null,"In dem Tabellenblatt \"Kosten\" können eingehende Rechnungen für Materialien, Dienstleistungen u.ä. erfasst werden"]
[null,null,"Sind noch keine Projekte angelegt oder ist das Projekt neu, so müssen zunächst Projekt-Nr. und -bezeichnung erfasst werden"]
[null,null,"Wenn die Projekt-Nr. und die Projektbezeichnung im Tabellenblatt \"Projektsummen\" vorhanden sind,"]
[null,null,"steht die Projekt-Nr. hier per Dropdown-Liste zur Verfügung und die Bezeichnung wird nach deren Eingabe automatisch ergänzt"]
[null,null,"Für die Erfassung der ersten Datensätze können die Beispieldaten einfach überschrieben oder gelöscht werden"]
[null,null,"Neue Rechnung eingeben:"]
[null,null,"In die nächste, freie Zeile unterhalb der formatierten Tabelle in Spalte B das Datum der neuen Rechnung eingeben"]
[null,null,"Die Dynamische Tabelle erweitert sich dadurch entsprechend um eine neue Zeile und weitere Daten der Rechnung können eingegeben werden"]
[null,null,"Die Projekt-Nr. ist über die Dropdown-Liste zu wählen, kann aber auch händisch eingegeben werden"]
[null,null,"Bei einer fehlerhaften oder nicht in dem Tabellenblatt \"Projektsummen\" angelegten Projekt-Nr. erscheint eine Fehlermeldung"]
[null,null,"Die Nettosumme berechnet sich automatisch anhand des Bruttobetrages und des MwSt-Satzes (als ganze Zahl eingeben)"]
[null,null,"In den ausgeblendeten Spalten K-N können weitere Daten wie z.B. Planwerte, Kostenarten, u.ä. eingetragen werden"]
[]
[null,null,"Tabellenblatt: Zeiten"]
[]
[null,null,"die folgende Inhalte enhält nur die Premiumversion"]
[]
[]
[]
[]
[]
[]
[]
[]
[]
[]
[]
[]
[]
[null,null,"Tabellenblatt: Projektsummen"]
[]
[]
[]
[]
[]
[]
[]
[]
[]
[]
[]
[]
[]
[]
[]
[null,null,"Tabellenblatt: Projektdetails"]
[]
[]
[]
[]
[]
[]
[]
[]
[]
[]
[null,null,"Makro:"]
[]
[]
[]
[]
[]
[null,{"$f":"CONCATENATE($C$9,\" \",$D$9)","v":"2. Praktische Hinweise zum Erstellen/Ausfüllen der Projektkostenerfassung"}]
[]
[]
[]
[]
[]
[]
[]
[]
[]
[]
[]
[]
[]
[]
[null,{"$f":"CONCATENATE($C$10,\" \",$D$10)","v":"3. Kostenlose Version vers. Premiumversion"}]
[]
[null,null,"Kostenlose Version der Projektkostenerfassung"]
[]
[null,null,"Die vorliegende, kostenlose Version der Projektkostenerfassung wird zur ausschließlichen privaten"]
[null,null,"oder auch persönlichen Nutzung in Unternehmen bereitgestellt. Die Struktur und die Daten in dieser Datei unterliegen"]
[null,null,"dem Urheberschutz. Sie können für den eigenen Gebrauch abgeändert und erweitert werden."]
[null,null,"Eine kommerzielle Nutzung sowie eine Weitergabe an Dritte ob entgeltlich oder unentgeltlich sind nicht gestattet"]
[null,null,"Sollten Sie die Datei weiterentwickeln, würden wir und unsere Community uns über Ihr Update freuen…"]
[null,null,"Über einen freiwilligen Obolus in Anerkennung unseres kostenfreien Angebotes freuen wir uns selbstverständlich auch:"]
[null,null,null,"Auf https://ko-fi.com/controllerspielwiese können Sie uns gerne einen Kaffee spendieren …"]
[null,null,"Wenn Ihnen unsere Arbeit gefällt, können Sie kostenfrei Mitglied auf der CS werden: "]
[null,null,null,"https://www.controllerspielwiese.de/inhalte/wir/formular-mitglied-werden.php"]
[null,null,"Sie bekommen dann unseren ca. 6-8 mal im Jahr erscheinenden Newsletter zugeschickt "]
[]
[null,null,"Premiumversion der Projektkostenerfassung"]
[]
[null,null,"In der Premiumversion sind alle Formeln und Funktionen frei zugänglich und veränderbar"]
[null,null,"Das Makro für die Erstellung der Projektdetails kann bis zu 4.992 Datensätze verarbeiten"]
[null,null,"Im Tabellenblatt \"Kosten\" können in Spalte K Bezeichnungen für die Kosten eingegeben werden, z.B. analog zur BWA"]
[null,null,"Es besteht kein Schreibschutz und alle Felder, Formeln und Kommentare sind frei änder- und löschbar"]
[null,null,"Die dynamischen Tabellen beinhalten nur zwei Beispieldatensätze. Somit sind die umfangreichen Beispieldaten nicht zuvor zu löschen"]
[null,null,"Die Datei enthält zusätzlich betriebswirtschaftliche Betrachtungen zur Projektkostenerfassung als Teil des Projektcontrollings"]
[]
[null,null,"Wenn Sie Interesse an der Premiumversion der Projektkostenerfassung haben, können Sie diese für EUR 8,98 inkl. MwSt erwerben:"]
[null,null,"1.","Sie senden eine E-Mail an Service@ControllerSpielwiese.de mit Ihrer Rechnungsadresse und dem Stichwort Projektkostenerfassung"]
[null,null,"2.","Wir senden Ihnen die Premiumversion umgehend während unserer Bürozeiten per E-Mail zu"]
[null,null,"3.","Sie erhalten Ihre Rechnung inkl. MwSt. per E-Mail zusammen mit Ihrer Datei"]
[]
[null,null,"Für das Funktionieren des Tools in Ihrer Umgebung sowie evtl. Folgeschäden übernehmen wir keine Haftung"]
[null,null,"Wir gewähren jedoch einen freiwilligen E-Mail-Support während unserer Bürozeiten"]
[null,null,"Das Tool wird aus dem Feedback unserer Mitglieder weiterentwickelt, updates sind kostenfrei erhältlich"]
[]
[]
[null,{"$f":"CONCATENATE($C$11,\" \",$D$11)","v":"4. Betriebswirtschaftliche Betrachtungen zur Projektkostenerfassung"}]
[]
[]
[]
[]
[]
[]
[]
[]
[]
[]
[]
[]
[]
[]
[]
[]
[]
[]
[]
[]
[]
[]
[]
[]
[]
[]
[]
[]
[]
[]
[]
[]
[]
[]
[]
[]
[]
[]
[]
[]
[]
[]
[]
[]
[]
[]
[]
[]
[]
[]
[]
[]
[]
[]
[]
[]
[]
[null,null,null,null,null,null,null,null,null,"oben "]